BDBM241341 US10479788, Example 185::US9409907, 185
SMILES: COc1cc(ccc1Nc1ncc2ccnc(NCC3(C)CCOC3)c2n1)-c1cnn(C)c1CO
InChI Key: InChIKey=FIHOKEBZXLEGDC-UHFFFAOYSA-N
Data: 2 IC50
Activity Spreadsheet -- Enzyme Inhibition Constant Data from BindingDB
Found 3 hits for monomerid = 241341
Trg + Lig
Ki
nM
ΔG°
kcal/mole
IC50
nM
Kd
nM
EC50/IC50
nM
koff
s-1
kon
M-1s-1
pHTemp
°C
Dual specificity protein kinase TTK
(Homo sapiens (Human))
BDBM241341
(US10479788, Example 185 | US11046688, Example 185 ...)
Show SMILES COc1cc(ccc1Nc1ncc2ccnc(NCC3(C)CCOC3)c2n1)-c1cnn(C)c1CO
Show InChI InChI=1S/C25H29N7O3/c1-25(7-9-35-15-25)14-28-23-22-17(6-8-26-23)11-27-24(31-22)30-19-5-4-16(10-21(19)34-3)18-12-29-32(2)20(18)13-33/h4-6,8,10-12,33H,7,9,13-15H2,1-3H3,(H,26,28)(H,27,30,31)
US Patent
n/an/a 1n/an/an/an/a7.025
Cancer Research Technology Limited
US Patent
Assay Description
The enzyme reaction (total volume 10 μl) was carried out in black 384-well low volume plates containing full length MPS1 (12.5 nM or 3 nM), fluo...
US Patent US9409907 (2016)
BindingDB Entry DOI: 10.7270/Q2C24VB2
Dual specificity protein kinase TTK
(Homo sapiens (Human))
BDBM241341
(US10479788, Example 185 | US11046688, Example 185 ...)
Show SMILES COc1cc(ccc1Nc1ncc2ccnc(NCC3(C)CCOC3)c2n1)-c1cnn(C)c1CO
Show InChI InChI=1S/C25H29N7O3/c1-25(7-9-35-15-25)14-28-23-22-17(6-8-26-23)11-27-24(31-22)30-19-5-4-16(10-21(19)34-3)18-12-29-32(2)20(18)13-33/h4-6,8,10-12,33H,7,9,13-15H2,1-3H3,(H,26,28)(H,27,30,31)
n/an/a 1n/an/an/an/an/an/a
TBA
Citation and Details
Dual specificity protein kinase TTK
(Homo sapiens (Human))
BDBM241341
(US10479788, Example 185 | US11046688, Example 185 ...)
Show SMILES COc1cc(ccc1Nc1ncc2ccnc(NCC3(C)CCOC3)c2n1)-c1cnn(C)c1CO
Show InChI InChI=1S/C25H29N7O3/c1-25(7-9-35-15-25)14-28-23-22-17(6-8-26-23)11-27-24(31-22)30-19-5-4-16(10-21(19)34-3)18-12-29-32(2)20(18)13-33/h4-6,8,10-12,33H,7,9,13-15H2,1-3H3,(H,26,28)(H,27,30,31)
US Patent
n/an/a 1n/an/an/an/an/an/a
Cancer Research Technology Limited
US Patent
Assay Description
The enzyme reaction (total volume 10 μl) was carried out in black 384-well low volume plates containing full length MPS1 (12.5 nM or 3 nM), fluo...
US Patent US10479788 (2019)
BindingDB Entry DOI: 10.7270/Q2BP055X