BDBM241360 US10479788, Example 204::US9409907, 204
SMILES: COC(C)(C)CNc1nccc2cnc(Nc3ccc(cc3OC(F)F)-c3cnn(C)c3)nc12
InChI Key: InChIKey=MBMGZVRAAURXAC-UHFFFAOYSA-N
Data: 2 IC50
Activity Spreadsheet -- Enzyme Inhibition Constant Data from BindingDB
Found 3 hits for monomerid = 241360
Trg + Lig
Ki
nM
ΔG°
kcal/mole
IC50
nM
Kd
nM
EC50/IC50
nM
koff
s-1
kon
M-1s-1
pHTemp
°C
Dual specificity protein kinase TTK
(Homo sapiens (Human))
BDBM241360
(US10479788, Example 204 | US11046688, Example 204 ...)
Show SMILES COC(C)(C)CNc1nccc2cnc(Nc3ccc(cc3OC(F)F)-c3cnn(C)c3)nc12
Show InChI InChI=1S/C23H25F2N7O2/c1-23(2,33-4)13-28-20-19-15(7-8-26-20)10-27-22(31-19)30-17-6-5-14(9-18(17)34-21(24)25)16-11-29-32(3)12-16/h5-12,21H,13H2,1-4H3,(H,26,28)(H,27,30,31)
US Patent
n/an/a 2n/an/an/an/a7.025
Cancer Research Technology Limited
US Patent
Assay Description
The enzyme reaction (total volume 10 μl) was carried out in black 384-well low volume plates containing full length MPS1 (12.5 nM or 3 nM), fluo...
US Patent US9409907 (2016)
BindingDB Entry DOI: 10.7270/Q2C24VB2
Dual specificity protein kinase TTK
(Homo sapiens (Human))
BDBM241360
(US10479788, Example 204 | US11046688, Example 204 ...)
Show SMILES COC(C)(C)CNc1nccc2cnc(Nc3ccc(cc3OC(F)F)-c3cnn(C)c3)nc12
Show InChI InChI=1S/C23H25F2N7O2/c1-23(2,33-4)13-28-20-19-15(7-8-26-20)10-27-22(31-19)30-17-6-5-14(9-18(17)34-21(24)25)16-11-29-32(3)12-16/h5-12,21H,13H2,1-4H3,(H,26,28)(H,27,30,31)
n/an/a 2n/an/an/an/an/an/a
TBA
Citation and Details
Dual specificity protein kinase TTK
(Homo sapiens (Human))
BDBM241360
(US10479788, Example 204 | US11046688, Example 204 ...)
Show SMILES COC(C)(C)CNc1nccc2cnc(Nc3ccc(cc3OC(F)F)-c3cnn(C)c3)nc12
Show InChI InChI=1S/C23H25F2N7O2/c1-23(2,33-4)13-28-20-19-15(7-8-26-20)10-27-22(31-19)30-17-6-5-14(9-18(17)34-21(24)25)16-11-29-32(3)12-16/h5-12,21H,13H2,1-4H3,(H,26,28)(H,27,30,31)
US Patent
n/an/a 2n/an/an/an/an/an/a
Cancer Research Technology Limited
US Patent
Assay Description
The enzyme reaction (total volume 10 μl) was carried out in black 384-well low volume plates containing full length MPS1 (12.5 nM or 3 nM), fluo...
US Patent US10479788 (2019)
BindingDB Entry DOI: 10.7270/Q2BP055X