null
SMILES: COC(=O)Nc1ccc-2c(NC(=O)[C@H](C)CCC[C@H](N3CCC(=CC3=O)c3c(F)cccc3C#N)c3cc-2ccn3)c1
InChI Key: InChIKey=HLWOCEXYCJLWGO-GDJIYFAZSA-N
Activity Spreadsheet -- Enzyme Inhibition Constant Data from BindingDB
Found 4 hits for monomerid = 241372
Trg + Lig
Ki
nM
ΔG°
kcal/mole
IC50
nM
Kd
nM
EC50/IC50
nM
koff
s-1
kon
M-1s-1
pHTemp
°C
Plasma kallikrein
(Homo sapiens (Human))
BDBM241372
(US9409908, 4 | US9951071, Example 4)
Show SMILES COC(=O)Nc1ccc-2c(NC(=O)[C@H](C)CCC[C@H](N3CCC(=CC3=O)c3c(F)cccc3C#N)c3cc-2ccn3)c1 |r,c:22|
Show InChI InChI=1S/C32H30FN5O4/c1-19-5-3-8-28(38-14-12-21(16-29(38)39)30-22(18-34)6-4-7-25(30)33)27-15-20(11-13-35-27)24-10-9-23(36-32(41)42-2)17-26(24)37-31(19)40/h4,6-7,9-11,13,15-17,19,28H,3,5,8,12,14H2,1-2H3,(H,36,41)(H,37,40)/t19-,28+/m1/s1
US Patent
1 -12.3n/an/an/an/an/an/a25
Bristol-Myers Squibb Company
US Patent
Assay Description
Plasma kallikrein determinations were made in 0.1 M sodium phosphate buffer at a pH of 7.5 containing 0.1-0.2 M sodium chloride and 0.5% PEG 8000. De...
US Patent US9409908 (2016)
BindingDB Entry DOI: 10.7270/Q27943K8
Plasma kallikrein
(Homo sapiens (Human))
BDBM241372
(US9409908, 4 | US9951071, Example 4)
Show SMILES COC(=O)Nc1ccc-2c(NC(=O)[C@H](C)CCC[C@H](N3CCC(=CC3=O)c3c(F)cccc3C#N)c3cc-2ccn3)c1 |r,c:22|
Show InChI InChI=1S/C32H30FN5O4/c1-19-5-3-8-28(38-14-12-21(16-29(38)39)30-22(18-34)6-4-7-25(30)33)27-15-20(11-13-35-27)24-10-9-23(36-32(41)42-2)17-26(24)37-31(19)40/h4,6-7,9-11,13,15-17,19,28H,3,5,8,12,14H2,1-2H3,(H,36,41)(H,37,40)/t19-,28+/m1/s1
US Patent
1n/an/an/an/an/an/an/an/a
Nerviano Medical Sciences Srl
Assay Description
Plasma kallikrein determinations were made in 0.1 M sodium phosphate buffer at a pH of 7.5 containing 0.1-0.2 M sodium chloride and 0.5% PEG 8000. De...
J Med Chem 51: 487-501 (2008)
BindingDB Entry DOI: 10.7270/Q2R78HKQ
Coagulation factor XI
(Homo sapiens (Human))
BDBM241372
(US9409908, 4 | US9951071, Example 4)
Show SMILES COC(=O)Nc1ccc-2c(NC(=O)[C@H](C)CCC[C@H](N3CCC(=CC3=O)c3c(F)cccc3C#N)c3cc-2ccn3)c1 |r,c:22|
Show InChI InChI=1S/C32H30FN5O4/c1-19-5-3-8-28(38-14-12-21(16-29(38)39)30-22(18-34)6-4-7-25(30)33)27-15-20(11-13-35-27)24-10-9-23(36-32(41)42-2)17-26(24)37-31(19)40/h4,6-7,9-11,13,15-17,19,28H,3,5,8,12,14H2,1-2H3,(H,36,41)(H,37,40)/t19-,28+/m1/s1
Reactome pathway
US Patent
2.64n/an/an/an/an/an/an/an/a
Nerviano Medical Sciences Srl
Assay Description
Factor XIa determinations were made in 50 mM HEPES buffer at pH 7.4 containing 145 mM NaCl, 5 mM KCl, and 0.1% PEG 8000 (polyethylene glycol; JT Bake...
J Med Chem 51: 487-501 (2008)
BindingDB Entry DOI: 10.7270/Q2R78HKQ
Coagulation factor IX
(Homo sapiens (Human))
BDBM241372
(US9409908, 4 | US9951071, Example 4)
Show SMILES COC(=O)Nc1ccc-2c(NC(=O)[C@H](C)CCC[C@H](N3CCC(=CC3=O)c3c(F)cccc3C#N)c3cc-2ccn3)c1 |r,c:22|
Show InChI InChI=1S/C32H30FN5O4/c1-19-5-3-8-28(38-14-12-21(16-29(38)39)30-22(18-34)6-4-7-25(30)33)27-15-20(11-13-35-27)24-10-9-23(36-32(41)42-2)17-26(24)37-31(19)40/h4,6-7,9-11,13,15-17,19,28H,3,5,8,12,14H2,1-2H3,(H,36,41)(H,37,40)/t19-,28+/m1/s1
Reactome pathway
US Patent
2.64n/an/an/an/an/an/a7.4n/a
Bristol-Myers Squibb Company
US Patent
Assay Description
Factor XIa determinations were made in 50 mM HEPES buffer at pH 7.4 containing 145 mM NaCl, 5 mM KCl, and 0.1% PEG 8000 (polyethylene glycol; JT Bake...
US Patent US9409908 (2016)
BindingDB Entry DOI: 10.7270/Q27943K8