null
SMILES: NC[C@H](F)CP(O)=O
InChI Key: InChIKey=LJNUIEQATDYXJH-VKHMYHEASA-N
Activity Spreadsheet -- Enzyme Inhibition Constant Data from BindingDB
Found 1 hit for monomerid = 24194
Trg + Lig
Ki
nM
ΔG°
kcal/mole
IC50
nM
Kd
nM
EC50/IC50
nM
koff
s-1
kon
M-1s-1
pHTemp
°C
Gamma-aminobutyric acid (GABA) B receptor 1/type B receptor subunit 2 [41-940]
(Rattus norvegicus (rat))
BDBM24194
(3-aminopropylphosphinic derivative, (S)-7 | [(2S)-...)
Show SMILES NC[C@H](F)CP(O)=O |r|
Show InChI InChI=1S/C3H9FNO2P/c4-3(1-5)2-8(6)7/h3,8H,1-2,5H2,(H,6,7)/t3-/m0/s1
Reactome pathway
70 -9.66n/an/a 250n/an/a7.422
AstraZeneca
Assay Description
Inhibition of [3H]GABA binding at GABAB receptor sites in rat brain synaptic membranes by test compounds was measured using a filtration binding assa...
J Med Chem 51: 4315-20 (2008)
Article DOI: 10.1021/jm701425k
BindingDB Entry DOI: 10.7270/Q2M32T2T