BDBM242199 US9415055, (+)2,4-dichloro-N-[2-(4,4-difluoro-1-piperidyl)-2-[2-(trifluoromethyl)pyrimidin-5-yl]ethyl]-6-fluoro-benzamide
SMILES: Fc1cc(Cl)cc(Cl)c1C(=O)NCC(N1CCC(F)(F)CC1)c1cnc(nc1)C(F)(F)F
InChI Key: InChIKey=YTVIRYBVSIAQQS-UHFFFAOYSA-N
Data: 1 IC50
Activity Spreadsheet -- Enzyme Inhibition Constant Data from BindingDB
Found 1 hit for monomerid = 242199
Trg + Lig
Ki
nM
ΔG°
kcal/mole
IC50
nM
Kd
nM
EC50/IC50
nM
koff
s-1
kon
M-1s-1
pHTemp
°C
P2X purinoceptor 7
(Homo sapiens (Human))
BDBM242199
(US9415055, (+)2,4-dichloro-N-[2-(4,4-difluoro-1-pi...)
Show SMILES Fc1cc(Cl)cc(Cl)c1C(=O)NCC(N1CCC(F)(F)CC1)c1cnc(nc1)C(F)(F)F
Show InChI InChI=1S/C19H16Cl2F6N4O/c20-11-5-12(21)15(13(22)6-11)16(32)28-9-14(31-3-1-18(23,24)2-4-31)10-7-29-17(30-8-10)19(25,26)27/h5-8,14H,1-4,9H2,(H,28,32)
US Patent
n/an/a 4.70n/an/an/an/a7.437
H. Lundbeck A/S
US Patent
Assay Description
Briefly, 293-human or mouse P2X7 stable cells were incubated in sucrose buffer, pH 7.4 [KCl (5 mM), NaH2PO42H2O (9.6 mM), HEPES (25 mM), sucrose (280...
US Patent US9415055 (2016)
BindingDB Entry DOI: 10.7270/Q2NC604C