BDBM242542 US9422240, 1-265::US9422240, 1-355
SMILES: OC(=O)CNC(=O)C1=C(O)CCN(Cc2ccc(Oc3ccc(Cl)cc3)cc2)C1=O
InChI Key: InChIKey=QSRZXEHECXXXOQ-UHFFFAOYSA-N
Data: 2 IC50
Activity Spreadsheet -- Enzyme Inhibition Constant Data from BindingDB
Found 2 hits for monomerid = 242542
Trg + Lig
Ki
nM
ΔG°
kcal/mole
IC50
nM
Kd
nM
EC50/IC50
nM
koff
s-1
kon
M-1s-1
pHTemp
°C
Egl nine homolog 1
(Homo sapiens (Human))
BDBM242542
(US9422240, 1-265 | US9422240, 1-355)
Show SMILES OC(=O)CNC(=O)C1=C(O)CCN(Cc2ccc(Oc3ccc(Cl)cc3)cc2)C1=O |c:7|
Show InChI InChI=1S/C21H19ClN2O6/c22-14-3-7-16(8-4-14)30-15-5-1-13(2-6-15)12-24-10-9-17(25)19(21(24)29)20(28)23-11-18(26)27/h1-8,25H,9-12H2,(H,23,28)(H,26,27)
Reactome pathway
US Patent
n/an/a 52n/an/an/an/a7.5n/a
TAISHO PHARMACEUTICAL CO., LTD
US Patent
Assay Description
The enzyme and the substrate were each diluted with a 50 mM tris-hydrochloric acid buffer (pH 7.5) containing 12.5 mM KCl, 3.75 mM MgCl2, 25 μM ...
US Patent US9422240 (2016)
BindingDB Entry DOI: 10.7270/Q24B307K
Egl nine homolog 1
(Homo sapiens (Human))
BDBM242542
(US9422240, 1-265 | US9422240, 1-355)
Show SMILES OC(=O)CNC(=O)C1=C(O)CCN(Cc2ccc(Oc3ccc(Cl)cc3)cc2)C1=O |c:7|
Show InChI InChI=1S/C21H19ClN2O6/c22-14-3-7-16(8-4-14)30-15-5-1-13(2-6-15)12-24-10-9-17(25)19(21(24)29)20(28)23-11-18(26)27/h1-8,25H,9-12H2,(H,23,28)(H,26,27)
Reactome pathway
US Patent
n/an/a 24n/an/an/an/a7.5n/a
TAISHO PHARMACEUTICAL CO., LTD
US Patent
Assay Description
The enzyme and the substrate were each diluted with a 50 mM tris-hydrochloric acid buffer (pH 7.5) containing 12.5 mM KCl, 3.75 mM MgCl2, 25 μM ...
US Patent US9422240 (2016)
BindingDB Entry DOI: 10.7270/Q24B307K