BDBM242554 US9422240, 1-296
SMILES: OC(=O)CNC(=O)C1=C(O)CCN(Cc2ccc(Oc3ccc(cc3)C3CC3)nc2)C1=O
InChI Key: InChIKey=FRLBQNHFDRCBNF-UHFFFAOYSA-N
Data: 1 IC50
Activity Spreadsheet -- Enzyme Inhibition Constant Data from BindingDB
Found 1 hit for monomerid = 242554
Trg + Lig
Ki
nM
ΔG°
kcal/mole
IC50
nM
Kd
nM
EC50/IC50
nM
koff
s-1
kon
M-1s-1
pHTemp
°C
Egl nine homolog 1
(Homo sapiens (Human))
BDBM242554
(US9422240, 1-296)
Show SMILES OC(=O)CNC(=O)C1=C(O)CCN(Cc2ccc(Oc3ccc(cc3)C3CC3)nc2)C1=O |c:7|
Show InChI InChI=1S/C23H23N3O6/c27-18-9-10-26(23(31)21(18)22(30)25-12-20(28)29)13-14-1-8-19(24-11-14)32-17-6-4-16(5-7-17)15-2-3-15/h1,4-8,11,15,27H,2-3,9-10,12-13H2,(H,25,30)(H,28,29)
Reactome pathway
US Patent
n/an/a 15n/an/an/an/a7.5n/a
TAISHO PHARMACEUTICAL CO., LTD
US Patent
Assay Description
The enzyme and the substrate were each diluted with a 50 mM tris-hydrochloric acid buffer (pH 7.5) containing 12.5 mM KCl, 3.75 mM MgCl2, 25 μM ...
US Patent US9422240 (2016)
BindingDB Entry DOI: 10.7270/Q24B307K