BDBM243055 PTP inhibitor, 4g
SMILES: Oc1cc(O)c2C(=O)CC(Oc2c1)c1ccc(Cl)cc1Cl
InChI Key: InChIKey=DAYJXDAFHPXZEY-UHFFFAOYSA-N
Data: 1 IC50
Activity Spreadsheet -- Enzyme Inhibition Constant Data from BindingDB
Found 1 hit for monomerid = 243055
Trg + Lig
Ki
nM
ΔG°
kcal/mole
IC50
nM
Kd
nM
EC50/IC50
nM
koff
s-1
kon
M-1s-1
pHTemp
°C
Protein-tyrosine phosphatase 1B
(Homo sapiens (Human))
BDBM243055
(PTP inhibitor, 4g)
Show SMILES Oc1cc(O)c2C(=O)CC(Oc2c1)c1ccc(Cl)cc1Cl
Show InChI InChI=1S/C15H10Cl2O4/c16-7-1-2-9(10(17)3-7)13-6-12(20)15-11(19)4-8(18)5-14(15)21-13/h1-5,13,18-19H,6H2
NCI pathway
Reactome pathway
n/an/a 2.40E+3n/an/an/an/a6.530
Yanbian University College of Pharmacy
Assay Description
Briefly, the enzymatic activity of the PTP1B catalytic domain was determinedat 30°C by monitoring the hydrolysis of pNPP. Dephosphorylation of pNPP g...
J Enzyme Inhib Med Chem 28: 1199-204 (2013)
Article DOI: 10.3109/14756366.2012.723206
BindingDB Entry DOI: 10.7270/Q2668C3G