BDBM243064 11-O-benzoylbergenin (2)
SMILES: COc1c(O)cc2C(=O)OC3[C@@H](O)[C@H](O)[C@@H](COC(=O)c4ccccc4)OC3c2c1O
InChI Key: InChIKey=SABKEQQMTGJUKE-DHFKODKKSA-N
Data: 1 IC50
Activity Spreadsheet -- Enzyme Inhibition Constant Data from BindingDB
Found 1 hit for monomerid = 243064
Trg + Lig
Ki
nM
ΔG°
kcal/mole
IC50
nM
Kd
nM
EC50/IC50
nM
koff
s-1
kon
M-1s-1
pHTemp
°C
Alpha-glucosidase MAL12
(Saccharomyces cerevisiae)
BDBM243064
(11-O-benzoylbergenin (2))
Show SMILES COc1c(O)cc2C(=O)OC3[C@@H](O)[C@H](O)[C@@H](COC(=O)c4ccccc4)OC3c2c1O |r|
Show InChI InChI=1S/C21H20O10/c1-28-17-11(22)7-10-13(15(17)24)18-19(31-21(10)27)16(25)14(23)12(30-18)8-29-20(26)9-5-3-2-4-6-9/h2-7,12,14,16,18-19,22-25H,8H2,1H3/t12-,14-,16+,18?,19?/m1/s1
Reactome pathway
n/an/a 1.18E+5n/an/an/an/a7.025
Kinki University
Assay Description
α-glucosidase (25 μL, 0.2 U/mL), 25 μL of various concentrations of samples, and 175 μL of 50 mM sodium phosphate buffer (pH 7.0)...
J Enzyme Inhib Med Chem 28: 1162-70 (2013)
Article DOI: 10.3109/14756366.2012.719503
BindingDB Entry DOI: 10.7270/Q22F7MCR