BDBM243065 11-O-p-hydroxybenzoylbergenin (3)
SMILES: COc1c(O)cc2C(=O)OC3[C@@H](O)[C@H](O)[C@@H](COC(=O)c4ccc(O)cc4)OC3c2c1O
InChI Key: InChIKey=NAWLFLCZABMDRM-DHFKODKKSA-N
Data: 1 IC50
Activity Spreadsheet -- Enzyme Inhibition Constant Data from BindingDB
Found 1 hit for monomerid = 243065
Trg + Lig
Ki
nM
ΔG°
kcal/mole
IC50
nM
Kd
nM
EC50/IC50
nM
koff
s-1
kon
M-1s-1
pHTemp
°C
Alpha-glucosidase MAL12
(Saccharomyces cerevisiae)
BDBM243065
(11-O-p-hydroxybenzoylbergenin (3))
Show SMILES COc1c(O)cc2C(=O)OC3[C@@H](O)[C@H](O)[C@@H](COC(=O)c4ccc(O)cc4)OC3c2c1O |r|
Show InChI InChI=1S/C21H20O11/c1-29-17-11(23)6-10-13(15(17)25)18-19(32-21(10)28)16(26)14(24)12(31-18)7-30-20(27)8-2-4-9(22)5-3-8/h2-6,12,14,16,18-19,22-26H,7H2,1H3/t12-,14-,16+,18?,19?/m1/s1
Reactome pathway
n/an/a 1.43E+5n/an/an/an/a7.025
Kinki University
Assay Description
α-glucosidase (25 μL, 0.2 U/mL), 25 μL of various concentrations of samples, and 175 μL of 50 mM sodium phosphate buffer (pH 7.0)...
J Enzyme Inhib Med Chem 28: 1162-70 (2013)
Article DOI: 10.3109/14756366.2012.719503
BindingDB Entry DOI: 10.7270/Q22F7MCR