null
SMILES: CC(C)(C)NC(=O)C1CCN(Cc2cccc(NC(=O)C3(CC3)c3ccccc3)c2)CC1
InChI Key: InChIKey=ZTZLWKZIIVDBSE-UHFFFAOYSA-N
Activity Spreadsheet -- Enzyme Inhibition Constant Data from BindingDB
Found 1 hit for monomerid = 243688
Trg + Lig
Ki
nM
ΔG°
kcal/mole
IC50
nM
Kd
nM
EC50/IC50
nM
koff
s-1
kon
M-1s-1
pHTemp
°C
Atypical chemokine receptor 3
(Homo sapiens (Human))
BDBM243688
(US9428456, 1.309)
Show SMILES CC(C)(C)NC(=O)C1CCN(Cc2cccc(NC(=O)C3(CC3)c3ccccc3)c2)CC1
Show InChI InChI=1S/C27H35N3O2/c1-26(2,3)29-24(31)21-12-16-30(17-13-21)19-20-8-7-11-23(18-20)28-25(32)27(14-15-27)22-9-5-4-6-10-22/h4-11,18,21H,12-17,19H2,1-3H3,(H,28,32)(H,29,31)
US Patent
n/an/an/an/a 1n/an/an/a37
ACTELION PHARMACEUTICALS LTD
US Patent
Assay Description
CHO-K1 CXCR7 b-arrestin cells are detached from culture dishes with a cell dissociation buffer (Invitrogen, #13151-014) and collected in growing medi...
US Patent US9428456 (2016)
BindingDB Entry DOI: 10.7270/Q29022PZ