null
SMILES: CCCNC(=O)C1CCN(Cc2cccc(NC(=O)c3cccc(n3)C(F)(F)F)c2)CC1
InChI Key: InChIKey=OXIGTXFNGDQLCW-UHFFFAOYSA-N
Activity Spreadsheet -- Enzyme Inhibition Constant Data from BindingDB
Found 1 hit for monomerid = 243715
Trg + Lig
Ki
nM
ΔG°
kcal/mole
IC50
nM
Kd
nM
EC50/IC50
nM
koff
s-1
kon
M-1s-1
pHTemp
°C
Atypical chemokine receptor 3
(Homo sapiens (Human))
BDBM243715
(US9428456, 2.094)
Show SMILES CCCNC(=O)C1CCN(Cc2cccc(NC(=O)c3cccc(n3)C(F)(F)F)c2)CC1
Show InChI InChI=1S/C23H27F3N4O2/c1-2-11-27-21(31)17-9-12-30(13-10-17)15-16-5-3-6-18(14-16)28-22(32)19-7-4-8-20(29-19)23(24,25)26/h3-8,14,17H,2,9-13,15H2,1H3,(H,27,31)(H,28,32)
US Patent
n/an/an/an/a 1n/an/an/a37
ACTELION PHARMACEUTICALS LTD
US Patent
Assay Description
CHO-K1 CXCR7 b-arrestin cells are detached from culture dishes with a cell dissociation buffer (Invitrogen, #13151-014) and collected in growing medi...
US Patent US9428456 (2016)
BindingDB Entry DOI: 10.7270/Q29022PZ