null
SMILES: CC(C)(C)NC(=O)C1CCN(Cc2cccc(NC(=O)c3ccc4ccccc4n3)c2)CC1
InChI Key: InChIKey=NLAOVKWBGPPYMF-UHFFFAOYSA-N
Activity Spreadsheet -- Enzyme Inhibition Constant Data from BindingDB
Found 1 hit for monomerid = 243897
Trg + Lig
Ki
nM
ΔG°
kcal/mole
IC50
nM
Kd
nM
EC50/IC50
nM
koff
s-1
kon
M-1s-1
pHTemp
°C
Atypical chemokine receptor 3
(Homo sapiens (Human))
BDBM243897
(US9428456, 1.235)
Show SMILES CC(C)(C)NC(=O)C1CCN(Cc2cccc(NC(=O)c3ccc4ccccc4n3)c2)CC1
Show InChI InChI=1S/C27H32N4O2/c1-27(2,3)30-25(32)21-13-15-31(16-14-21)18-19-7-6-9-22(17-19)28-26(33)24-12-11-20-8-4-5-10-23(20)29-24/h4-12,17,21H,13-16,18H2,1-3H3,(H,28,33)(H,30,32)
US Patent
n/an/an/an/a 0.900n/an/an/a37
ACTELION PHARMACEUTICALS LTD
US Patent
Assay Description
CHO-K1 CXCR7 b-arrestin cells are detached from culture dishes with a cell dissociation buffer (Invitrogen, #13151-014) and collected in growing medi...
US Patent US9428456 (2016)
BindingDB Entry DOI: 10.7270/Q29022PZ