BDBM24403 5,6-dimethyl-N-(naphthalen-2-yl)-[1,2,4]triazolo[1,5-a]pyrimidin-7-amine::Triazolopyrimidine-Based Compound, 10
SMILES: Cc1nc2ncnn2c(Nc2ccc3ccccc3c2)c1C
InChI Key: InChIKey=QKTRQKWOYXJVQT-UHFFFAOYSA-N
Data: 1 IC50
Activity Spreadsheet -- Enzyme Inhibition Constant Data from BindingDB
Found 1 hit for monomerid = 24403
Trg + Lig
Ki
nM
ΔG°
kcal/mole
IC50
nM
Kd
nM
EC50/IC50
nM
koff
s-1
kon
M-1s-1
pHTemp
°C
Dihydroorotate dehydrogenase (quinone), mitochondrial
(Plasmodium falciparum (isolate 3D7))
BDBM24403
(5,6-dimethyl-N-(naphthalen-2-yl)-[1,2,4]triazolo[1...)
Show SMILES Cc1nc2ncnn2c(Nc2ccc3ccccc3c2)c1C
Show InChI InChI=1S/C17H15N5/c1-11-12(2)20-17-18-10-19-22(17)16(11)21-15-8-7-13-5-3-4-6-14(13)9-15/h3-10,21H,1-2H3
n/an/a 160n/an/an/an/a8.020
University of Texas Southwestern Medical Center at Dallas
Assay Description
The assays were carried out by using a colorimetric DCIP method, which uses the colorimetric reagent 2, 6-dichlorophenolindophenol as the final elect...
J Med Chem 51: 3649-53 (2008)
Article DOI: 10.1021/jm8001026
BindingDB Entry DOI: 10.7270/Q2PV6HNF