null
SMILES: COc1ccc(cc1)N1CCN(CC1)C(=O)CNc1ccc(F)cc1
InChI Key: InChIKey=YHZUAOOBYJIYIH-UHFFFAOYSA-N
Activity Spreadsheet -- Enzyme Inhibition Constant Data from BindingDB
Found 1 hit for monomerid = 244062
Trg + Lig
Ki
nM
ΔG°
kcal/mole
IC50
nM
Kd
nM
EC50/IC50
nM
koff
s-1
kon
M-1s-1
pHTemp
°C
Cytochrome b-245 heavy chain
(Homo sapiens (Human))
BDBM244062
(US9428478, TG6-167-1)
Show SMILES COc1ccc(cc1)N1CCN(CC1)C(=O)CNc1ccc(F)cc1
Show InChI InChI=1S/C19H22FN3O2/c1-25-18-8-6-17(7-9-18)22-10-12-23(13-11-22)19(24)14-21-16-4-2-15(20)3-5-16/h2-9,21H,10-14H2,1H3
US Patent
n/an/a 3.00E+9n/an/an/an/an/an/a
Emory University
US Patent
Assay Description
Nox2 activity assay for primary screening: Plasma membranes were prepared from human neutrophils, which express large amounts of Nox2, stored at W...
US Patent US9428478 (2016)
BindingDB Entry DOI: 10.7270/Q2RX9B09