BDBM244065 US9428478, TG2-171-1
SMILES: CC(=O)c1ccc(NCC(=O)N2CCN(CC2)c2ccccc2O)cc1
InChI Key: InChIKey=ZJDIVFMFAZLGTM-UHFFFAOYSA-N
Data: 2 IC50
Activity Spreadsheet -- Enzyme Inhibition Constant Data from BindingDB
Found 2 hits for monomerid = 244065
Trg + Lig
Ki
nM
ΔG°
kcal/mole
IC50
nM
Kd
nM
EC50/IC50
nM
koff
s-1
kon
M-1s-1
pHTemp
°C
Xanthine dehydrogenase/oxidase
(Homo sapiens (Human))
BDBM244065
(US9428478, TG2-171-1)
Show SMILES CC(=O)c1ccc(NCC(=O)N2CCN(CC2)c2ccccc2O)cc1
Show InChI InChI=1S/C20H23N3O3/c1-15(24)16-6-8-17(9-7-16)21-14-20(26)23-12-10-22(11-13-23)18-4-2-3-5-19(18)25/h2-9,21,25H,10-14H2,1H3
US Patent
n/an/a 2.00E+8n/an/an/an/an/an/a
Emory University
US Patent
Assay Description
Assay controls. To rule out interference with either Nox2 or Nox4 luminescence assays, two approaches are used. In one, xanthine oxidase replaces the...
US Patent US9428478 (2016)
BindingDB Entry DOI: 10.7270/Q2RX9B09
Cytochrome b-245 heavy chain
(Homo sapiens (Human))
BDBM244065
(US9428478, TG2-171-1)
Show SMILES CC(=O)c1ccc(NCC(=O)N2CCN(CC2)c2ccccc2O)cc1
Show InChI InChI=1S/C20H23N3O3/c1-15(24)16-6-8-17(9-7-16)21-14-20(26)23-12-10-22(11-13-23)18-4-2-3-5-19(18)25/h2-9,21,25H,10-14H2,1H3
US Patent
n/an/a 5.00E+8n/an/an/an/an/an/a
Emory University
US Patent
Assay Description
Nox2 activity assay for primary screening: Plasma membranes were prepared from human neutrophils, which express large amounts of Nox2, stored at W...
US Patent US9428478 (2016)
BindingDB Entry DOI: 10.7270/Q2RX9B09