BDBM244083 US9428478, TG6-227
SMILES: COc1ccc(cc1)N1CCN(CC1)C(=O)c1cc2cc(ccc2[nH]1)C(N)=O
InChI Key: InChIKey=WYDFHSJVCWUBMG-UHFFFAOYSA-N
Data: 2 IC50
Activity Spreadsheet -- Enzyme Inhibition Constant Data from BindingDB
Found 2 hits for monomerid = 244083
Trg + Lig
Ki
nM
ΔG°
kcal/mole
IC50
nM
Kd
nM
EC50/IC50
nM
koff
s-1
kon
M-1s-1
pHTemp
°C
Xanthine dehydrogenase/oxidase
(Homo sapiens (Human))
BDBM244083
(US9428478, TG6-227)
Show SMILES COc1ccc(cc1)N1CCN(CC1)C(=O)c1cc2cc(ccc2[nH]1)C(N)=O
Show InChI InChI=1S/C21H22N4O3/c1-28-17-5-3-16(4-6-17)24-8-10-25(11-9-24)21(27)19-13-15-12-14(20(22)26)2-7-18(15)23-19/h2-7,12-13,23H,8-11H2,1H3,(H2,22,26)
US Patent
n/an/a>2.00E+10n/an/an/an/an/an/a
Emory University
US Patent
Assay Description
Assay controls. To rule out interference with either Nox2 or Nox4 luminescence assays, two approaches are used. In one, xanthine oxidase replaces the...
US Patent US9428478 (2016)
BindingDB Entry DOI: 10.7270/Q2RX9B09
Cytochrome b-245 heavy chain
(Homo sapiens (Human))
BDBM244083
(US9428478, TG6-227)
Show SMILES COc1ccc(cc1)N1CCN(CC1)C(=O)c1cc2cc(ccc2[nH]1)C(N)=O
Show InChI InChI=1S/C21H22N4O3/c1-28-17-5-3-16(4-6-17)24-8-10-25(11-9-24)21(27)19-13-15-12-14(20(22)26)2-7-18(15)23-19/h2-7,12-13,23H,8-11H2,1H3,(H2,22,26)
US Patent
n/an/a 7.00E+8n/an/an/an/an/an/a
Emory University
US Patent
Assay Description
Nox2 activity assay for primary screening: Plasma membranes were prepared from human neutrophils, which express large amounts of Nox2, stored at W...
US Patent US9428478 (2016)
BindingDB Entry DOI: 10.7270/Q2RX9B09