BDBM24412 5-methyl-N-phenyl-[1,2,4]triazolo[1,5-a]pyrimidin-7-amine::JMC521864 Compund DSM12::Triazolopyrimidine-Based Compound, 19
SMILES: Cc1cc(Nc2ccccc2)n2ncnc2n1
InChI Key: InChIKey=RLASLOLCTAMGCE-UHFFFAOYSA-N
Data: 4 IC50
Activity Spreadsheet -- Enzyme Inhibition Constant Data from BindingDB
Found 4 hits for monomerid = 24412
Trg + Lig
Ki
nM
ΔG°
kcal/mole
IC50
nM
Kd
nM
EC50/IC50
nM
koff
s-1
kon
M-1s-1
pHTemp
°C
Dihydroorotate dehydrogenase (quinone), mitochondrial
(Plasmodium falciparum (isolate 3D7))
BDBM24412
(5-methyl-N-phenyl-[1,2,4]triazolo[1,5-a]pyrimidin-...)
Show SMILES Cc1cc(Nc2ccccc2)n2ncnc2n1
Show InChI InChI=1S/C12H11N5/c1-9-7-11(16-10-5-3-2-4-6-10)17-12(15-9)13-8-14-17/h2-8,16H,1H3
n/an/a>1.00E+5n/an/an/an/a8.020
University of Texas Southwestern Medical Center at Dallas
Assay Description
The assays were carried out by using a colorimetric DCIP method, which uses the colorimetric reagent 2, 6-dichlorophenolindophenol as the final elect...
J Med Chem 51: 3649-53 (2008)
Article DOI: 10.1021/jm8001026
BindingDB Entry DOI: 10.7270/Q2PV6HNF
Dihydroorotate Dehydrogenase (DHODH)
(Homo sapiens (Human))
BDBM24412
(5-methyl-N-phenyl-[1,2,4]triazolo[1,5-a]pyrimidin-...)
Show SMILES Cc1cc(Nc2ccccc2)n2ncnc2n1
Show InChI InChI=1S/C12H11N5/c1-9-7-11(16-10-5-3-2-4-6-10)17-12(15-9)13-8-14-17/h2-8,16H,1H3
Reactome pathway
n/an/a>2.00E+5n/an/an/an/an/an/a
University of Washington at Seattle
Assay Description
The assays were carried out by using a colorimetric DCIP method, which uses the colorimetric reagent 2, 6-dichlorophenolindophenol as the final elect...
J Med Chem 52: 1864-72 (2009)
Article DOI: 10.1021/jm801343r
BindingDB Entry DOI: 10.7270/Q2QN653C
Dihydroorotate Dehydrogenase (DHODH)
(Plasmodium berghei)
BDBM24412
(5-methyl-N-phenyl-[1,2,4]triazolo[1,5-a]pyrimidin-...)
Show SMILES Cc1cc(Nc2ccccc2)n2ncnc2n1
Show InChI InChI=1S/C12H11N5/c1-9-7-11(16-10-5-3-2-4-6-10)17-12(15-9)13-8-14-17/h2-8,16H,1H3
n/an/a>1.00E+4n/an/an/an/an/an/a
University of Washington at Seattle
Assay Description
The assays were carried out by using a colorimetric DCIP method, which uses the colorimetric reagent 2, 6-dichlorophenolindophenol as the final elect...
J Med Chem 52: 1864-72 (2009)
Article DOI: 10.1021/jm801343r
BindingDB Entry DOI: 10.7270/Q2QN653C
Dihydroorotate dehydrogenase (quinone), mitochondrial
(Plasmodium falciparum (isolate 3D7))
BDBM24412
(5-methyl-N-phenyl-[1,2,4]triazolo[1,5-a]pyrimidin-...)
Show SMILES Cc1cc(Nc2ccccc2)n2ncnc2n1
Show InChI InChI=1S/C12H11N5/c1-9-7-11(16-10-5-3-2-4-6-10)17-12(15-9)13-8-14-17/h2-8,16H,1H3
n/an/a>2.00E+5n/an/an/an/a8.020
University of Washington at Seattle
Assay Description
The assays were carried out by using a colorimetric DCIP method, which uses the colorimetric reagent 2, 6-dichlorophenolindophenol as the final elect...
J Med Chem 52: 1864-72 (2009)
Article DOI: 10.1021/jm801343r
BindingDB Entry DOI: 10.7270/Q2QN653C