BDBM24458 2-[(3-fluoro-4-{1H-pyrrolo[2,3-b]pyridin-4-yloxy}phenyl)carbamoyl]-6-(4-fluorophenyl)-1-oxidopyridin-1-ium::pyridine N-oxide analogue, 49
SMILES: [O-][n+]1c(cccc1-c1ccc(F)cc1)C(=O)Nc1ccc(Oc2ccnc3[nH]ccc23)c(F)c1
InChI Key: InChIKey=UQVQABXFQLZIAR-UHFFFAOYSA-N
Data: 2 IC50
Activity Spreadsheet -- Enzyme Inhibition Constant Data from BindingDB
Found 2 hits for monomerid = 24458
Trg + Lig
Ki
nM
ΔG°
kcal/mole
IC50
nM
Kd
nM
EC50/IC50
nM
koff
s-1
kon
M-1s-1
pHTemp
°C
Hepatocyte growth factor receptor
(Homo sapiens (Human))
BDBM24458
(2-[(3-fluoro-4-{1H-pyrrolo[2,3-b]pyridin-4-yloxy}p...)
Show SMILES [O-][n+]1c(cccc1-c1ccc(F)cc1)C(=O)Nc1ccc(Oc2ccnc3[nH]ccc23)c(F)c1
Show InChI InChI=1S/C25H16F2N4O3/c26-16-6-4-15(5-7-16)20-2-1-3-21(31(20)33)25(32)30-17-8-9-23(19(27)14-17)34-22-11-13-29-24-18(22)10-12-28-24/h1-14H,(H,28,29)(H,30,32)
n/an/a 1.80n/an/an/an/an/an/a
Sichuan University
Curated by ChEMBL
Assay Description
Inhibition of human c-MET
Eur J Med Chem 46: 3675-80 (2011)
Article DOI: 10.1016/j.ejmech.2011.05.031
BindingDB Entry DOI: 10.7270/Q2891676
Hepatocyte growth factor receptor
(Homo sapiens (Human))
BDBM24458
(2-[(3-fluoro-4-{1H-pyrrolo[2,3-b]pyridin-4-yloxy}p...)
Show SMILES [O-][n+]1c(cccc1-c1ccc(F)cc1)C(=O)Nc1ccc(Oc2ccnc3[nH]ccc23)c(F)c1
Show InChI InChI=1S/C25H16F2N4O3/c26-16-6-4-15(5-7-16)20-2-1-3-21(31(20)33)25(32)30-17-8-9-23(19(27)14-17)34-22-11-13-29-24-18(22)10-12-28-24/h1-14H,(H,28,29)(H,30,32)
n/an/a 1.80n/an/an/an/a7.530
Bristol-Myers Squibb Company
Assay Description
Kinase activity was assayed using baculovirus expressed GST-Met, and poly(Glu/Tyr) as the substrate. Dose response curves were generated to determine...
J Med Chem 51: 5330-41 (2008)
Article DOI: 10.1021/jm800476q
BindingDB Entry DOI: 10.7270/Q2K35RZG