BDBM24482 7-methoxy-4-{[6-(4-methylthiophen-2-yl)-[1,2,4]triazolo[4,3-a]pyridazin-3-yl]methoxy}quinoline::Triazolopyridazine, 10l
SMILES: COc1ccc2c(OCc3nnc4ccc(nn34)-c3cc(C)cs3)ccnc2c1
InChI Key: InChIKey=BFCPIHBZBBKELU-UHFFFAOYSA-N
Data: 1 IC50
Activity Spreadsheet -- Enzyme Inhibition Constant Data from BindingDB
Found 1 hit for monomerid = 24482
Trg + Lig
Ki
nM
ΔG°
kcal/mole
IC50
nM
Kd
nM
EC50/IC50
nM
koff
s-1
kon
M-1s-1
pHTemp
°C
Hepatocyte growth factor receptor
(Homo sapiens (Human))
BDBM24482
(7-methoxy-4-{[6-(4-methylthiophen-2-yl)-[1,2,4]tri...)
Show SMILES COc1ccc2c(OCc3nnc4ccc(nn34)-c3cc(C)cs3)ccnc2c1
Show InChI InChI=1S/C21H17N5O2S/c1-13-9-19(29-12-13)16-5-6-20-23-24-21(26(20)25-16)11-28-18-7-8-22-17-10-14(27-2)3-4-15(17)18/h3-10,12H,11H2,1-2H3
n/an/a 1n/an/an/an/a7.422
Amgen
Assay Description
In vitro kinase assays were done to establish IC50 values against recombinant enzymes using homogeneous time-resolved fluorescence (HTRF) assay. Mole...
J Med Chem 51: 2879-82 (2008)
Article DOI: 10.1021/jm800043g
BindingDB Entry DOI: 10.7270/Q29P2ZZ6