BDBM24493 7-(2-fluoro-4-{[(1-phenylacetamido)methanethioyl]amino}phenoxy)-N,N-dimethylthieno[3,2-b]pyridine-2-carboxamide::thieno[3,2-b]pyridine-based inhibitor, 8c
SMILES: CN(C)C(=O)c1cc2nccc(Oc3ccc(NC(=S)NC(=O)Cc4ccccc4)cc3F)c2s1
InChI Key: InChIKey=FVIIFUOCWXBFMO-UHFFFAOYSA-N
Data: 3 IC50
Activity Spreadsheet -- Enzyme Inhibition Constant Data from BindingDB
Found 3 hits for monomerid = 24493
Trg + Lig
Ki
nM
ΔG°
kcal/mole
IC50
nM
Kd
nM
EC50/IC50
nM
koff
s-1
kon
M-1s-1
pHTemp
°C
Hepatocyte growth factor receptor
(Homo sapiens (Human))
BDBM24493
(7-(2-fluoro-4-{[(1-phenylacetamido)methanethioyl]a...)
Show SMILES CN(C)C(=O)c1cc2nccc(Oc3ccc(NC(=S)NC(=O)Cc4ccccc4)cc3F)c2s1
Show InChI InChI=1S/C25H21FN4O3S2/c1-30(2)24(32)21-14-18-23(35-21)20(10-11-27-18)33-19-9-8-16(13-17(19)26)28-25(34)29-22(31)12-15-6-4-3-5-7-15/h3-11,13-14H,12H2,1-2H3,(H2,28,29,31,34)
n/an/a 48n/an/an/an/a7.530
MethylGene Inc.
Assay Description
Inhibition of kinase activity was measured in a DELFIA assay (Perkin-Elmer). The substrate poly (Glu4, Tyr) was immobilized onto black high-binding p...
Bioorg Med Chem Lett 18: 2793-8 (2008)
Article DOI: 10.1016/j.bmcl.2008.04.009
BindingDB Entry DOI: 10.7270/Q25X2778
Hepatocyte growth factor receptor
(Homo sapiens (Human))
BDBM24493
(7-(2-fluoro-4-{[(1-phenylacetamido)methanethioyl]a...)
Show SMILES CN(C)C(=O)c1cc2nccc(Oc3ccc(NC(=S)NC(=O)Cc4ccccc4)cc3F)c2s1
Show InChI InChI=1S/C25H21FN4O3S2/c1-30(2)24(32)21-14-18-23(35-21)20(10-11-27-18)33-19-9-8-16(13-17(19)26)28-25(34)29-22(31)12-15-6-4-3-5-7-15/h3-11,13-14H,12H2,1-2H3,(H2,28,29,31,34)
n/an/a 48n/an/an/an/an/an/a
Sichuan University
Curated by ChEMBL
Assay Description
Inhibition of human c-MET
Eur J Med Chem 46: 3675-80 (2011)
Article DOI: 10.1016/j.ejmech.2011.05.031
BindingDB Entry DOI: 10.7270/Q2891676
Vascular endothelial growth factor receptor 2
(Homo sapiens (Human))
BDBM24493
(7-(2-fluoro-4-{[(1-phenylacetamido)methanethioyl]a...)
Show SMILES CN(C)C(=O)c1cc2nccc(Oc3ccc(NC(=S)NC(=O)Cc4ccccc4)cc3F)c2s1
Show InChI InChI=1S/C25H21FN4O3S2/c1-30(2)24(32)21-14-18-23(35-21)20(10-11-27-18)33-19-9-8-16(13-17(19)26)28-25(34)29-22(31)12-15-6-4-3-5-7-15/h3-11,13-14H,12H2,1-2H3,(H2,28,29,31,34)
NCI pathway
Reactome pathway
n/an/a 19n/an/an/an/an/an/a
MethylGene Inc.
Assay Description
Inhibition of kinase activity was measured in a DELFIA assay (Perkin-Elmer). The substrate poly (Glu4, Tyr) was immobilized onto black high-binding p...
Bioorg Med Chem Lett 18: 2793-8 (2008)
Article DOI: 10.1016/j.bmcl.2008.04.009
BindingDB Entry DOI: 10.7270/Q25X2778