BDBM24505 3-(3-fluoro-4-{[2-(pyridin-2-yl)thieno[3,2-b]pyridin-7-yl]oxy}phenyl)-1-(2-phenylacetyl)thiourea::thieno[3,2-b]pyridine-based inhibitor, 10h
SMILES: Fc1cc(NC(=S)NC(=O)Cc2ccccc2)ccc1Oc1ccnc2cc(sc12)-c1ccccn1
InChI Key: InChIKey=YHNFDTDPUBTIIP-UHFFFAOYSA-N
Data: 3 IC50
Activity Spreadsheet -- Enzyme Inhibition Constant Data from BindingDB
Found 3 hits for monomerid = 24505
Trg + Lig
Ki
nM
ΔG°
kcal/mole
IC50
nM
Kd
nM
EC50/IC50
nM
koff
s-1
kon
M-1s-1
pHTemp
°C
Hepatocyte growth factor receptor
(Homo sapiens (Human))
BDBM24505
(3-(3-fluoro-4-{[2-(pyridin-2-yl)thieno[3,2-b]pyrid...)
Show SMILES Fc1cc(NC(=S)NC(=O)Cc2ccccc2)ccc1Oc1ccnc2cc(sc12)-c1ccccn1
Show InChI InChI=1S/C27H19FN4O2S2/c28-19-15-18(31-27(35)32-25(33)14-17-6-2-1-3-7-17)9-10-22(19)34-23-11-13-30-21-16-24(36-26(21)23)20-8-4-5-12-29-20/h1-13,15-16H,14H2,(H2,31,32,33,35)
n/an/a 62n/an/an/an/a7.530
MethylGene Inc.
Assay Description
Inhibition of kinase activity was measured in a DELFIA assay (Perkin-Elmer). The substrate poly (Glu4, Tyr) was immobilized onto black high-binding p...
Bioorg Med Chem Lett 18: 2793-8 (2008)
Article DOI: 10.1016/j.bmcl.2008.04.009
BindingDB Entry DOI: 10.7270/Q25X2778
Hepatocyte growth factor receptor
(Homo sapiens (Human))
BDBM24505
(3-(3-fluoro-4-{[2-(pyridin-2-yl)thieno[3,2-b]pyrid...)
Show SMILES Fc1cc(NC(=S)NC(=O)Cc2ccccc2)ccc1Oc1ccnc2cc(sc12)-c1ccccn1
Show InChI InChI=1S/C27H19FN4O2S2/c28-19-15-18(31-27(35)32-25(33)14-17-6-2-1-3-7-17)9-10-22(19)34-23-11-13-30-21-16-24(36-26(21)23)20-8-4-5-12-29-20/h1-13,15-16H,14H2,(H2,31,32,33,35)
n/an/a 62n/an/an/an/an/an/a
Sichuan University
Curated by ChEMBL
Assay Description
Inhibition of human c-MET
Eur J Med Chem 46: 3675-80 (2011)
Article DOI: 10.1016/j.ejmech.2011.05.031
BindingDB Entry DOI: 10.7270/Q2891676
Vascular endothelial growth factor receptor 2
(Homo sapiens (Human))
BDBM24505
(3-(3-fluoro-4-{[2-(pyridin-2-yl)thieno[3,2-b]pyrid...)
Show SMILES Fc1cc(NC(=S)NC(=O)Cc2ccccc2)ccc1Oc1ccnc2cc(sc12)-c1ccccn1
Show InChI InChI=1S/C27H19FN4O2S2/c28-19-15-18(31-27(35)32-25(33)14-17-6-2-1-3-7-17)9-10-22(19)34-23-11-13-30-21-16-24(36-26(21)23)20-8-4-5-12-29-20/h1-13,15-16H,14H2,(H2,31,32,33,35)
NCI pathway
Reactome pathway
n/an/a 17n/an/an/an/an/an/a
MethylGene Inc.
Assay Description
Inhibition of kinase activity was measured in a DELFIA assay (Perkin-Elmer). The substrate poly (Glu4, Tyr) was immobilized onto black high-binding p...
Bioorg Med Chem Lett 18: 2793-8 (2008)
Article DOI: 10.1016/j.bmcl.2008.04.009
BindingDB Entry DOI: 10.7270/Q25X2778