null
SMILES: CN1CCN(CC1)c1ccc(cc1)-c1ccc2[nH]c3nccc(\C=C\c4cccc(F)c4)c3c2c1
InChI Key: InChIKey=OYUSBNCAAKVRRW-AATRIKPKSA-N
Activity Spreadsheet -- Enzyme Inhibition Constant Data from BindingDB
Found 2 hits for monomerid = 245212
Trg + Lig
Ki
nM
ΔG°
kcal/mole
IC50
nM
Kd
nM
EC50/IC50
nM
koff
s-1
kon
M-1s-1
pHTemp
°C
ALK tyrosine kinase receptor [L1196M]
(Homo sapiens (Human))
BDBM245212
(US9428500, 6)
Show SMILES CN1CCN(CC1)c1ccc(cc1)-c1ccc2[nH]c3nccc(\C=C\c4cccc(F)c4)c3c2c1
Show InChI InChI=1S/C30H27FN4/c1-34-15-17-35(18-16-34)26-10-7-22(8-11-26)24-9-12-28-27(20-24)29-23(13-14-32-30(29)33-28)6-5-21-3-2-4-25(31)19-21/h2-14,19-20H,15-18H2,1H3,(H,32,33)/b6-5+
US Patent
n/an/a 320n/an/an/an/a7.530
UNIVERSITA DEGLI STUDI DI MILANO—BICOCCA; UNIVERSITE DE GENEVE; UNIVERSITE CLAUDE BERNARD—LYON
US Patent
Assay Description
GST-tagged recombinant wild-type or L1196M mutated ALK kinase (rALK) was expressed in Sf9 insect cells using the pBacPAK baculovirus vector system (C...
US Patent US9428500 (2016)
BindingDB Entry DOI: 10.7270/Q2CR5S8M
ALK tyrosine kinase receptor
(Homo sapiens (Human))
BDBM245212
(US9428500, 6)
Show SMILES CN1CCN(CC1)c1ccc(cc1)-c1ccc2[nH]c3nccc(\C=C\c4cccc(F)c4)c3c2c1
Show InChI InChI=1S/C30H27FN4/c1-34-15-17-35(18-16-34)26-10-7-22(8-11-26)24-9-12-28-27(20-24)29-23(13-14-32-30(29)33-28)6-5-21-3-2-4-25(31)19-21/h2-14,19-20H,15-18H2,1H3,(H,32,33)/b6-5+
US Patent
n/an/a 250n/an/an/an/a7.530
UNIVERSITA DEGLI STUDI DI MILANO—BICOCCA; UNIVERSITE DE GENEVE; UNIVERSITE CLAUDE BERNARD—LYON
US Patent
Assay Description
GST-tagged recombinant wild-type or L1196M mutated ALK kinase (rALK) was expressed in Sf9 insect cells using the pBacPAK baculovirus vector system (C...
US Patent US9428500 (2016)
BindingDB Entry DOI: 10.7270/Q2CR5S8M