BDBM245248 US9428500, 42
SMILES: CN1CCN(CC1)c1ccc(cc1)-c1ccc2[nH]c3nccc(C#Cc4ccccc4Cl)c3c2c1
InChI Key: InChIKey=AWBAFSLGFMFSLI-UHFFFAOYSA-N
Data: 2 IC50
Activity Spreadsheet -- Enzyme Inhibition Constant Data from BindingDB
Found 2 hits for monomerid = 245248
Trg + Lig
Ki
nM
ΔG°
kcal/mole
IC50
nM
Kd
nM
EC50/IC50
nM
koff
s-1
kon
M-1s-1
pHTemp
°C
ALK tyrosine kinase receptor (L1196M)
(Homo sapiens (Human))
BDBM245248
(US9428500, 42)
Show SMILES CN1CCN(CC1)c1ccc(cc1)-c1ccc2[nH]c3nccc(C#Cc4ccccc4Cl)c3c2c1
Show InChI InChI=1S/C30H25ClN4/c1-34-16-18-35(19-17-34)25-11-8-21(9-12-25)24-10-13-28-26(20-24)29-23(14-15-32-30(29)33-28)7-6-22-4-2-3-5-27(22)31/h2-5,8-15,20H,16-19H2,1H3,(H,32,33)
US Patent
n/an/a 290n/an/an/an/a7.530
UNIVERSITA DEGLI STUDI DI MILANO—BICOCCA; UNIVERSITE DE GENEVE; UNIVERSITE CLAUDE BERNARD—LYON
US Patent
Assay Description
GST-tagged recombinant wild-type or L1196M mutated ALK kinase (rALK) was expressed in Sf9 insect cells using the pBacPAK baculovirus vector system (C...
US Patent US9428500 (2016)
BindingDB Entry DOI: 10.7270/Q2CR5S8M
ALK tyrosine kinase receptor
(Homo sapiens (Human))
BDBM245248
(US9428500, 42)
Show SMILES CN1CCN(CC1)c1ccc(cc1)-c1ccc2[nH]c3nccc(C#Cc4ccccc4Cl)c3c2c1
Show InChI InChI=1S/C30H25ClN4/c1-34-16-18-35(19-17-34)25-11-8-21(9-12-25)24-10-13-28-26(20-24)29-23(14-15-32-30(29)33-28)7-6-22-4-2-3-5-27(22)31/h2-5,8-15,20H,16-19H2,1H3,(H,32,33)
US Patent
n/an/a 1.20E+3n/an/an/an/a7.530
UNIVERSITA DEGLI STUDI DI MILANO—BICOCCA; UNIVERSITE DE GENEVE; UNIVERSITE CLAUDE BERNARD—LYON
US Patent
Assay Description
GST-tagged recombinant wild-type or L1196M mutated ALK kinase (rALK) was expressed in Sf9 insect cells using the pBacPAK baculovirus vector system (C...
US Patent US9428500 (2016)
BindingDB Entry DOI: 10.7270/Q2CR5S8M