null
SMILES: CC(C)(C)CN1CCC2(CN(c3c2c(F)ccc3O)c2ccccc2NC(=O)Nc2ccc(cc2)C(C)(C)C)CC1
InChI Key: InChIKey=CGYCHCUKOLXHNK-UHFFFAOYSA-N
Activity Spreadsheet -- Enzyme Inhibition Constant Data from BindingDB
Found 1 hit for monomerid = 245271
Trg + Lig
Ki
nM
ΔG°
kcal/mole
IC50
nM
Kd
nM
EC50/IC50
nM
koff
s-1
kon
M-1s-1
pHTemp
°C
P2Y purinoceptor 1
(Homo sapiens (Human))
BDBM245271
(US9428504, 7)
Show SMILES CC(C)(C)CN1CCC2(CN(c3c2c(F)ccc3O)c2ccccc2NC(=O)Nc2ccc(cc2)C(C)(C)C)CC1
Show InChI InChI=1S/C34H43FN4O2/c1-32(2,3)21-38-19-17-34(18-20-38)22-39(30-28(40)16-15-25(35)29(30)34)27-10-8-7-9-26(27)37-31(41)36-24-13-11-23(12-14-24)33(4,5)6/h7-16,40H,17-22H2,1-6H3,(H2,36,37,41)
US Patent
4 -11.4n/an/an/an/an/a7.425
Bristol-Myers Squibb Company
US Patent
Assay Description
A SPA membrane binding assay was used to identify inhibitors of [33P] 2MeS-ADP binding to cloned human P2Y1 receptors (The P2Y1 receptor membranes we...
US Patent US9428504 (2016)
BindingDB Entry DOI: 10.7270/Q24748SD