BDBM245342 US9428504, 91
SMILES: CCN(CC)S(=O)(=O)c1ccc(O)c2N(CC3(CCN(CC(C)(C)C)CC3)c12)c1ccccc1NC(=O)Nc1ccc(OC(F)(F)F)cc1
InChI Key: InChIKey=LLJFWFPWJMADGI-UHFFFAOYSA-N
Data: 1 KI
Activity Spreadsheet -- Enzyme Inhibition Constant Data from BindingDB
Found 1 hit for monomerid = 245342
Trg + Lig
Ki
nM
ΔG°
kcal/mole
IC50
nM
Kd
nM
EC50/IC50
nM
koff
s-1
kon
M-1s-1
pHTemp
°C
P2Y purinoceptor 1
(Homo sapiens (Human))
BDBM245342
(US9428504, 91)
Show SMILES CCN(CC)S(=O)(=O)c1ccc(O)c2N(CC3(CCN(CC(C)(C)C)CC3)c12)c1ccccc1NC(=O)Nc1ccc(OC(F)(F)F)cc1
Show InChI InChI=1S/C35H44F3N5O5S/c1-6-42(7-2)49(46,47)29-17-16-28(44)31-30(29)34(18-20-41(21-19-34)22-33(3,4)5)23-43(31)27-11-9-8-10-26(27)40-32(45)39-24-12-14-25(15-13-24)48-35(36,37)38/h8-17,44H,6-7,18-23H2,1-5H3,(H2,39,40,45)
US Patent
3.40 -11.5n/an/an/an/an/a7.425
Bristol-Myers Squibb Company
US Patent
Assay Description
A SPA membrane binding assay was used to identify inhibitors of [33P] 2MeS-ADP binding to cloned human P2Y1 receptors (The P2Y1 receptor membranes we...
US Patent US9428504 (2016)
BindingDB Entry DOI: 10.7270/Q24748SD