null
SMILES: CC(C)(C)CN1CCC2(CN(c3c2c(ccc3O)-c2nc3ccc(F)cc3s2)c2ccccc2NC(=O)Nc2csc(Cl)n2)CC1
InChI Key: InChIKey=KCPGVRPSYYANRR-UHFFFAOYSA-N
Activity Spreadsheet -- Enzyme Inhibition Constant Data from BindingDB
Found 1 hit for monomerid = 245365
Trg + Lig
Ki
nM
ΔG°
kcal/mole
IC50
nM
Kd
nM
EC50/IC50
nM
koff
s-1
kon
M-1s-1
pHTemp
°C
P2Y purinoceptor 1
(Homo sapiens (Human))
BDBM245365
(US9428504, 114)
Show SMILES CC(C)(C)CN1CCC2(CN(c3c2c(ccc3O)-c2nc3ccc(F)cc3s2)c2ccccc2NC(=O)Nc2csc(Cl)n2)CC1
Show InChI InChI=1S/C34H34ClFN6O2S2/c1-33(2,3)18-41-14-12-34(13-15-41)19-42(24-7-5-4-6-22(24)38-32(44)40-27-17-45-31(35)39-27)29-25(43)11-9-21(28(29)34)30-37-23-10-8-20(36)16-26(23)46-30/h4-11,16-17,43H,12-15,18-19H2,1-3H3,(H2,38,40,44)
US Patent
5.60 -11.2n/an/an/an/an/a7.425
Bristol-Myers Squibb Company
US Patent
Assay Description
A SPA membrane binding assay was used to identify inhibitors of [33P] 2MeS-ADP binding to cloned human P2Y1 receptors (The P2Y1 receptor membranes we...
US Patent US9428504 (2016)
BindingDB Entry DOI: 10.7270/Q24748SD