null
SMILES: CCCCCCCCCCC[C@@H](C[C@@H]1OC(=O)[C@H]1CCCCCC)OC(=O)CNC=O
InChI Key: InChIKey=ANPULBVRORHAGO-VABKMULXSA-N
Activity Spreadsheet -- Enzyme Inhibition Constant Data from BindingDB
Found 7 hits for monomerid = 24586
Trg + Lig
Ki
nM
ΔG°
kcal/mole
IC50
nM
Kd
nM
EC50/IC50
nM
koff
s-1
kon
M-1s-1
pHTemp
°C
Monoglyceride lipase
(Homo sapiens (Human))
BDBM24586
((1R)-1-{[(2S,3S)-3-hexyl-4-oxooxetan-2-yl]methyl}d...)
Show SMILES CCCCCCCCCCC[C@@H](C[C@@H]1OC(=O)[C@H]1CCCCCC)OC(=O)CNC=O |r|
Show InChI InChI=1S/C25H45NO5/c1-3-5-7-9-10-11-12-13-14-16-21(30-24(28)19-26-20-27)18-23-22(25(29)31-23)17-15-8-6-4-2/h20-23H,3-19H2,1-2H3,(H,26,27)/t21-,22-,23-/m0/s1
Reactome pathway
n/an/a 890n/an/an/an/an/an/a
Department of Chemical and Pharmaceutical Sciences, University of Ferrara , 44121 Ferrara, Italy.
Curated by ChEMBL
Assay Description
Inhibition of recombinant human MAGL expressed in African green monkey COS7 cells using 2-arachidonoyl-[3H]-glycerol as substrate after 20 mins by sc...
J Med Chem 61: 1340-1354 (2018)
Article DOI: 10.1021/acs.jmedchem.7b01845
BindingDB Entry DOI: 10.7270/Q2JM2D3V
Fatty acid synthase [2202-2509]
(Homo sapiens (Human))
BDBM24586
((1R)-1-{[(2S,3S)-3-hexyl-4-oxooxetan-2-yl]methyl}d...)
Show SMILES CCCCCCCCCCC[C@@H](C[C@@H]1OC(=O)[C@H]1CCCCCC)OC(=O)CNC=O |r|
Show InChI InChI=1S/C25H45NO5/c1-3-5-7-9-10-11-12-13-14-16-21(30-24(28)19-26-20-27)18-23-22(25(29)31-23)17-15-8-6-4-2/h20-23H,3-19H2,1-2H3,(H,26,27)/t21-,22-,23-/m0/s1
n/an/a 1.02E+3n/an/an/an/a7.437
The Burnham Institute for Medical Research
Assay Description
The reaction mixture consisted of FAS thioesterase domain (FASTE) in buffer, which was preincubated with test compounds for 30 min. The reaction was ...
J Med Chem 51: 5285-96 (2008)
Article DOI: 10.1021/jm800321h
BindingDB Entry DOI: 10.7270/Q2NV9GJH
Fatty acid synthase [2202-2509]
(Homo sapiens (Human))
BDBM24586
((1R)-1-{[(2S,3S)-3-hexyl-4-oxooxetan-2-yl]methyl}d...)
Show SMILES CCCCCCCCCCC[C@@H](C[C@@H]1OC(=O)[C@H]1CCCCCC)OC(=O)CNC=O |r|
Show InChI InChI=1S/C25H45NO5/c1-3-5-7-9-10-11-12-13-14-16-21(30-24(28)19-26-20-27)18-23-22(25(29)31-23)17-15-8-6-4-2/h20-23H,3-19H2,1-2H3,(H,26,27)/t21-,22-,23-/m0/s1
n/an/a 1.72E+3n/an/an/an/a7.437
The Burnham Institute for Medical Research
Assay Description
The reaction mixture consisted of FAS thioesterase domain (FASTE) in buffer, which was preincubated with test compounds for 30 min. The reaction was ...
J Med Chem 51: 5285-96 (2008)
Article DOI: 10.1021/jm800321h
BindingDB Entry DOI: 10.7270/Q2NV9GJH
Diacylglycerol lipase-alpha
(Homo sapiens (Human))
BDBM24586
((1R)-1-{[(2S,3S)-3-hexyl-4-oxooxetan-2-yl]methyl}d...)
Show SMILES CCCCCCCCCCC[C@@H](C[C@@H]1OC(=O)[C@H]1CCCCCC)OC(=O)CNC=O |r|
Show InChI InChI=1S/C25H45NO5/c1-3-5-7-9-10-11-12-13-14-16-21(30-24(28)19-26-20-27)18-23-22(25(29)31-23)17-15-8-6-4-2/h20-23H,3-19H2,1-2H3,(H,26,27)/t21-,22-,23-/m0/s1
NCI pathway
Reactome pathway
n/an/a 2.80E+3n/an/an/an/an/an/a
Sapienza Università di Roma
Curated by ChEMBL
Assay Description
Inhibition of human recombinant DAGLalpha-mediated sn-1-[14C]oleoyl-2-arachidonoyl-glycerol hydrolysis to 2-AG overexpressed in african green monkey ...
J Med Chem 51: 6970-9 (2008)
Article DOI: 10.1021/jm800978m
BindingDB Entry DOI: 10.7270/Q2251J1D
Fatty-acid amide hydrolase 1 [30-579]
(Rattus norvegicus (rat))
BDBM24586
((1R)-1-{[(2S,3S)-3-hexyl-4-oxooxetan-2-yl]methyl}d...)
Show SMILES CCCCCCCCCCC[C@@H](C[C@@H]1OC(=O)[C@H]1CCCCCC)OC(=O)CNC=O |r|
Show InChI InChI=1S/C25H45NO5/c1-3-5-7-9-10-11-12-13-14-16-21(30-24(28)19-26-20-27)18-23-22(25(29)31-23)17-15-8-6-4-2/h20-23H,3-19H2,1-2H3,(H,26,27)/t21-,22-,23-/m0/s1
n/an/a 3.00E+3n/an/an/an/an/an/a
Sapienza Università di Roma
Curated by ChEMBL
Assay Description
Inhibition of FAAH-mediated [14C]anadamide hydrolysis in rat brain membrane
J Med Chem 51: 6970-9 (2008)
Article DOI: 10.1021/jm800978m
BindingDB Entry DOI: 10.7270/Q2251J1D
Cannabinoid receptor 2
(Homo sapiens (Human))
BDBM24586
((1R)-1-{[(2S,3S)-3-hexyl-4-oxooxetan-2-yl]methyl}d...)
Show SMILES CCCCCCCCCCC[C@@H](C[C@@H]1OC(=O)[C@H]1CCCCCC)OC(=O)CNC=O |r|
Show InChI InChI=1S/C25H45NO5/c1-3-5-7-9-10-11-12-13-14-16-21(30-24(28)19-26-20-27)18-23-22(25(29)31-23)17-15-8-6-4-2/h20-23H,3-19H2,1-2H3,(H,26,27)/t21-,22-,23-/m0/s1
Reactome pathway
>1.00E+4n/an/an/an/an/an/an/an/a
Sapienza Università di Roma
Curated by ChEMBL
Assay Description
Displacement of [3H]CP55940 from human recombinant CB2 receptor expressed in HEK293 cells by scintillation counting
J Med Chem 51: 6970-9 (2008)
Article DOI: 10.1021/jm800978m
BindingDB Entry DOI: 10.7270/Q2251J1D
Cannabinoid receptor 1
(Homo sapiens (Human))
BDBM24586
((1R)-1-{[(2S,3S)-3-hexyl-4-oxooxetan-2-yl]methyl}d...)
Show SMILES CCCCCCCCCCC[C@@H](C[C@@H]1OC(=O)[C@H]1CCCCCC)OC(=O)CNC=O |r|
Show InChI InChI=1S/C25H45NO5/c1-3-5-7-9-10-11-12-13-14-16-21(30-24(28)19-26-20-27)18-23-22(25(29)31-23)17-15-8-6-4-2/h20-23H,3-19H2,1-2H3,(H,26,27)/t21-,22-,23-/m0/s1
NCI pathway
Reactome pathway
>1.00E+4n/an/an/an/an/an/an/an/a
Sapienza Università di Roma
Curated by ChEMBL
Assay Description
Displacement of [3H]CP55940 from human recombinant CB1 receptor expressed in HEK293 cells by scintillation counting
J Med Chem 51: 6970-9 (2008)
Article DOI: 10.1021/jm800978m
BindingDB Entry DOI: 10.7270/Q2251J1D