BDBM246473 4-(4-Fluorophenyl)-6-(9-methyl-9H-carbazol-3-yl)-pyrimidin-2-amine (5e)
SMILES: Cn1c2ccccc2c2cc(ccc12)-c1cc(nc(N)n1)-c1ccc(F)cc1
InChI Key: InChIKey=XVZDVCMPOKBNIC-UHFFFAOYSA-N
Data: 1 IC50
Activity Spreadsheet -- Enzyme Inhibition Constant Data from BindingDB
Found 1 hit for monomerid = 246473
Trg + Lig
Ki
nM
ΔG°
kcal/mole
IC50
nM
Kd
nM
EC50/IC50
nM
koff
s-1
kon
M-1s-1
pHTemp
°C
Urease
(Canavalia ensiformis (Jack bean) (Horse bean))
BDBM246473
(4-(4-Fluorophenyl)-6-(9-methyl-9H-carbazol-3-yl)-p...)
Show SMILES Cn1c2ccccc2c2cc(ccc12)-c1cc(nc(N)n1)-c1ccc(F)cc1
Show InChI InChI=1S/C23H17FN4/c1-28-21-5-3-2-4-17(21)18-12-15(8-11-22(18)28)20-13-19(26-23(25)27-20)14-6-9-16(24)10-7-14/h2-13H,1H3,(H2,25,26,27)
n/an/a>1.00E+5n/an/an/an/a6.830
Solapur University
Assay Description
Mixture of 25 μL of urease enzyme (Jack bean) solution containing 1 unit of enzyme (1 unit = 0.02 mg of enzyme) was dissolved in phosphate buffe...
J Enzyme Inhib Med Chem 28: 1316-23 (2013)
Article DOI: 10.3109/14756366.2012.740477
BindingDB Entry DOI: 10.7270/Q2J965BH