BDBM246505 1-Phenyl-3-(4-(1,3,7,7-tetramethyl-5-oxo-1,2,3,4,5,6,7,8-octahydroquinazolin-4-yl)phenyl)urea (4a)
SMILES: CN1C(C2=C(CC(C)(C)CC2=O)N(C)C1=O)c1ccc(NC(=O)Nc2ccccc2)cc1
InChI Key: InChIKey=OLWMDXJKUKHZLO-UHFFFAOYSA-N
Data: 2 IC50
Activity Spreadsheet -- Enzyme Inhibition Constant Data from BindingDB
Found 2 hits for monomerid = 246505
Trg + Lig
Ki
nM
ΔG°
kcal/mole
IC50
nM
Kd
nM
EC50/IC50
nM
koff
s-1
kon
M-1s-1
pHTemp
°C
Carbonic anhydrase 2
(Homo sapiens (Human))
BDBM246505
(1-Phenyl-3-(4-(1,3,7,7-tetramethyl-5-oxo-1,2,3,4,5...)
Show SMILES CN1C(C2=C(CC(C)(C)CC2=O)N(C)C1=O)c1ccc(NC(=O)Nc2ccccc2)cc1 |t:3|
Show InChI InChI=1S/C25H28N4O3/c1-25(2)14-19-21(20(30)15-25)22(29(4)24(32)28(19)3)16-10-12-18(13-11-16)27-23(31)26-17-8-6-5-7-9-17/h5-13,22H,14-15H2,1-4H3,(H2,26,27,31)
Reactome pathway
n/an/a 1.53E+5n/an/an/an/an/an/a
Sakarya University
Assay Description
For the inhibition studies of sulphanilamide, different concentrationsof these compounds were added to the enzyme. Activity percentage values of CA f...
J Enzyme Inhib Med Chem 29: 18-22 (2014)
Article DOI: 10.3109/14756366.2012.746972
BindingDB Entry DOI: 10.7270/Q28S4NVM
Carbonic anhydrase 1
(Homo sapiens (Human))
BDBM246505
(1-Phenyl-3-(4-(1,3,7,7-tetramethyl-5-oxo-1,2,3,4,5...)
Show SMILES CN1C(C2=C(CC(C)(C)CC2=O)N(C)C1=O)c1ccc(NC(=O)Nc2ccccc2)cc1 |t:3|
Show InChI InChI=1S/C25H28N4O3/c1-25(2)14-19-21(20(30)15-25)22(29(4)24(32)28(19)3)16-10-12-18(13-11-16)27-23(31)26-17-8-6-5-7-9-17/h5-13,22H,14-15H2,1-4H3,(H2,26,27,31)
NCI pathway
Reactome pathway
n/an/a 1.35E+5n/an/an/an/an/an/a
Sakarya University
Assay Description
For the inhibition studies of sulphanilamide, different concentrationsof these compounds were added to the enzyme. Activity percentage values of CA f...
J Enzyme Inhib Med Chem 29: 18-22 (2014)
Article DOI: 10.3109/14756366.2012.746972
BindingDB Entry DOI: 10.7270/Q28S4NVM