BDBM246848 Cis-10-methoxy-3,3,11-trimethyl-7-oxo-1,2,3,3a,7,12b-hexahydrocyclopenta[c]pyrido[2,1-a]isoquinoline-6-carboxylic acid::US10053461, 39
SMILES: CCc1cc2[C@H]3CCC(C)(C)[C@H]3n3cc(C(O)=O)c(=O)cc3-c2cc1OC
InChI Key: InChIKey=IGDSSSPHMULAGH-XCLFUZPHSA-N
Data: 1 IC50
Activity Spreadsheet -- Enzyme Inhibition Constant Data from BindingDB
Found 1 hit for monomerid = 246848
Trg + Lig
Ki
nM
ΔG°
kcal/mole
IC50
nM
Kd
nM
EC50/IC50
nM
koff
s-1
kon
M-1s-1
pHTemp
°C
Large envelope protein
(Hepatitis B virus)
BDBM246848
(Cis-10-methoxy-3,3,11-trimethyl-7-oxo-1,2,3,3a,7,1...)
Show SMILES CCc1cc2[C@H]3CCC(C)(C)[C@H]3n3cc(C(O)=O)c(=O)cc3-c2cc1OC |r|
Show InChI InChI=1S/C22H25NO4/c1-5-12-8-14-13-6-7-22(2,3)20(13)23-11-16(21(25)26)18(24)10-17(23)15(14)9-19(12)27-4/h8-11,13,20H,5-7H2,1-4H3,(H,25,26)/t13-,20+/m1/s1
US Patent
n/an/a 20n/an/an/an/an/a25
Hoffmann-La Roche Inc.
US Patent
Assay Description
HepG2.2.15 cells were seeded in duplicate into white, 96-well plates at 1.5×104 cells/well. The cells were treated with a three-fold serial dilution ...
US Patent US10053461 (2018)
BindingDB Entry DOI: 10.7270/Q2Q81G3D