BDBM24695 2-N-benzyl-5-bromo-4-N-(5-cyclopropyl-1H-pyrazol-3-yl)pyrimidine-2,4-diamine::4-aminopyrazolylpyrimidine analogue, 10a
SMILES: Brc1cnc(NCc2ccccc2)nc1Nc1cc(n[nH]1)C1CC1
InChI Key: InChIKey=IZEZSPVHWUPXAH-UHFFFAOYSA-N
Data: 1 IC50
Activity Spreadsheet -- Enzyme Inhibition Constant Data from BindingDB
Found 1 hit for monomerid = 24695
Trg + Lig
Ki
nM
ΔG°
kcal/mole
IC50
nM
Kd
nM
EC50/IC50
nM
koff
s-1
kon
M-1s-1
pHTemp
°C
High affinity nerve growth factor receptor
(Homo sapiens (Human))
BDBM24695
(2-N-benzyl-5-bromo-4-N-(5-cyclopropyl-1H-pyrazol-3...)
Show SMILES Brc1cnc(NCc2ccccc2)nc1Nc1cc(n[nH]1)C1CC1
Show InChI InChI=1S/C17H17BrN6/c18-13-10-20-17(19-9-11-4-2-1-3-5-11)22-16(13)21-15-8-14(23-24-15)12-6-7-12/h1-5,8,10,12H,6-7,9H2,(H3,19,20,21,22,23,24)
n/an/a 750n/an/an/an/a7.422
AstraZeneca
Assay Description
TrkA kinase activity was determined by measuring the kinase ability to phosphorylate synthetic tyrosine residues within a generic polypeptide substra...
J Med Chem 51: 4672-84 (2008)
Article DOI: 10.1021/jm800343j
BindingDB Entry DOI: 10.7270/Q2RN365V