BDBM24705 4-aminopyrazolylpyrimidine analogue, 10k::5-bromo-4-N-(5-cyclopropyl-1H-pyrazol-3-yl)-2-N-[(1S)-1-(4-fluorophenyl)ethyl]pyrimidine-2,4-diamine
SMILES: C[C@H](Nc1ncc(Br)c(Nc2cc(n[nH]2)C2CC2)n1)c1ccc(F)cc1
InChI Key: InChIKey=BJULBAQIZYUYFI-JTQLQIEISA-N
Data: 1 IC50
Activity Spreadsheet -- Enzyme Inhibition Constant Data from BindingDB
Found 1 hit for monomerid = 24705
Trg + Lig
Ki
nM
ΔG°
kcal/mole
IC50
nM
Kd
nM
EC50/IC50
nM
koff
s-1
kon
M-1s-1
pHTemp
°C
High affinity nerve growth factor receptor
(Homo sapiens (Human))
BDBM24705
(4-aminopyrazolylpyrimidine analogue, 10k | 5-bromo...)
Show SMILES C[C@H](Nc1ncc(Br)c(Nc2cc(n[nH]2)C2CC2)n1)c1ccc(F)cc1 |r|
Show InChI InChI=1S/C18H18BrFN6/c1-10(11-4-6-13(20)7-5-11)22-18-21-9-14(19)17(24-18)23-16-8-15(25-26-16)12-2-3-12/h4-10,12H,2-3H2,1H3,(H3,21,22,23,24,25,26)/t10-/m0/s1
n/an/a 6n/an/an/an/a7.422
AstraZeneca
Assay Description
TrkA kinase activity was determined by measuring the kinase ability to phosphorylate synthetic tyrosine residues within a generic polypeptide substra...
J Med Chem 51: 4672-84 (2008)
Article DOI: 10.1021/jm800343j
BindingDB Entry DOI: 10.7270/Q2RN365V