null
SMILES: CC(C)n1ccc(n1)C1=C(c2nnn[nH]2)C(=O)N[C@@](C1)(c1ccc(CCCCC(F)(F)F)cc1)C(F)(F)F
InChI Key:
Activity Spreadsheet -- Enzyme Inhibition Constant Data from BindingDB
Found 1 hit for monomerid = 247169
Trg + Lig
Ki
nM
ΔG°
kcal/mole
IC50
nM
Kd
nM
EC50/IC50
nM
koff
s-1
kon
M-1s-1
pHTemp
°C
Alpha-1,6-mannosyl-glycoprotein 2-beta-N-acetylglucosaminyltransferase
(Homo sapiens (Human))
BDBM247169
(1-(5-Ethylthiazol-2-yl)ethanone | US9701672, 23)
Show SMILES CC(C)n1ccc(n1)C1=C(c2nnn[nH]2)C(=O)N[C@@](C1)(c1ccc(CCCCC(F)(F)F)cc1)C(F)(F)F |r,c:9|
US Patent
n/an/a 2.10n/an/an/an/a7.4n/a
Bristol-Myers Squibb Company
US Patent
Assay Description
The MGAT enzyme reactions were performed in Corning FALCONŽ 96-well polypropylene plates, in a total volume of 60 μL of 50 mM potassium phosphat...
US Patent US9701672 (2017)
BindingDB Entry DOI: 10.7270/Q2DV1MXW