BDBM24750 2-benzyl-5-{4-[(6,7-dimethoxyquinolin-4-yl)oxy]-3-fluorophenyl}-3-methyl-3,4-dihydropyrimidin-4-one::pyrimidone, 7
SMILES: COc1cc2nccc(Oc3ccc(cc3F)-c3cnc(Cc4ccccc4)n(C)c3=O)c2cc1OC
InChI Key: InChIKey=IKPJWGNTDNCFPS-UHFFFAOYSA-N
Data: 2 KI  1 IC50
PDB links: 1 PDB ID matches this monomer. 1 PDB ID contains this monomer as substructures. 1 PDB ID contains inhibitors having a similarity of 90% to this monomer.
Activity Spreadsheet -- Enzyme Inhibition Constant Data from BindingDB
Found 3 hits for monomerid = 24750
Trg + Lig
Ki
nM
ΔG°
kcal/mole
IC50
nM
Kd
nM
EC50/IC50
nM
koff
s-1
kon
M-1s-1
pHTemp
°C
Hepatocyte growth factor receptor
(Homo sapiens (Human))
BDBM24750
(2-benzyl-5-{4-[(6,7-dimethoxyquinolin-4-yl)oxy]-3-...)
Show SMILES COc1cc2nccc(Oc3ccc(cc3F)-c3cnc(Cc4ccccc4)n(C)c3=O)c2cc1OC
Show InChI InChI=1S/C29H24FN3O4/c1-33-28(13-18-7-5-4-6-8-18)32-17-21(29(33)34)19-9-10-25(22(30)14-19)37-24-11-12-31-23-16-27(36-3)26(35-2)15-20(23)24/h4-12,14-17H,13H2,1-3H3
39 -10.0n/an/an/an/an/a7.522
Amgen
Assay Description
In vitro kinase assays were done to establish IC50 values against recombinant enzymes using homogeneous time-resolved fluorescence (HTRF) assay. For ...
J Med Chem 51: 5766-79 (2008)
Article DOI: 10.1021/jm8006189
BindingDB Entry DOI: 10.7270/Q23X84XN
3D
3D Structure (crystal)
Vascular endothelial growth factor receptor 2
(Homo sapiens (Human))
BDBM24750
(2-benzyl-5-{4-[(6,7-dimethoxyquinolin-4-yl)oxy]-3-...)
Show SMILES COc1cc2nccc(Oc3ccc(cc3F)-c3cnc(Cc4ccccc4)n(C)c3=O)c2cc1OC
Show InChI InChI=1S/C29H24FN3O4/c1-33-28(13-18-7-5-4-6-8-18)32-17-21(29(33)34)19-9-10-25(22(30)14-19)37-24-11-12-31-23-16-27(36-3)26(35-2)15-20(23)24/h4-12,14-17H,13H2,1-3H3
NCI pathway
Reactome pathway
>1.30E+3>-7.94n/an/an/an/an/a7.522
Amgen
Assay Description
In vitro kinase assays were done to establish IC50 values against recombinant enzymes using homogeneous time-resolved fluorescence (HTRF) assay. For ...
J Med Chem 51: 5766-79 (2008)
Article DOI: 10.1021/jm8006189
BindingDB Entry DOI: 10.7270/Q23X84XN
Hepatocyte growth factor receptor
(Homo sapiens (Human))
BDBM24750
(2-benzyl-5-{4-[(6,7-dimethoxyquinolin-4-yl)oxy]-3-...)
Show SMILES COc1cc2nccc(Oc3ccc(cc3F)-c3cnc(Cc4ccccc4)n(C)c3=O)c2cc1OC
Show InChI InChI=1S/C29H24FN3O4/c1-33-28(13-18-7-5-4-6-8-18)32-17-21(29(33)34)19-9-10-25(22(30)14-19)37-24-11-12-31-23-16-27(36-3)26(35-2)15-20(23)24/h4-12,14-17H,13H2,1-3H3
n/an/a 39n/an/an/an/an/an/a
Sichuan University
Curated by ChEMBL
Assay Description
Inhibition of human c-MET
Eur J Med Chem 46: 3675-80 (2011)
Article DOI: 10.1016/j.ejmech.2011.05.031
BindingDB Entry DOI: 10.7270/Q2891676
3D
3D Structure (crystal)