BDBM24759 2-[amino(phenyl)methyl]-5-{4-[(6,7-dimethoxyquinolin-4-yl)oxy]-3-fluorophenyl}-3-methyl-3,4-dihydropyrimidin-4-one::pyrimidone, 37
SMILES: COc1cc2nccc(Oc3ccc(cc3F)-c3cnc(C(N)c4ccccc4)n(C)c3=O)c2cc1OC
InChI Key: InChIKey=CFZUQQDNJOFAHF-UHFFFAOYSA-N
Data: 1 KI  1 IC50
Activity Spreadsheet -- Enzyme Inhibition Constant Data from BindingDB
Found 2 hits for monomerid = 24759
Trg + Lig
Ki
nM
ΔG°
kcal/mole
IC50
nM
Kd
nM
EC50/IC50
nM
koff
s-1
kon
M-1s-1
pHTemp
°C
Hepatocyte growth factor receptor
(Homo sapiens (Human))
BDBM24759
(2-[amino(phenyl)methyl]-5-{4-[(6,7-dimethoxyquinol...)
Show SMILES COc1cc2nccc(Oc3ccc(cc3F)-c3cnc(C(N)c4ccccc4)n(C)c3=O)c2cc1OC
Show InChI InChI=1S/C29H25FN4O4/c1-34-28(27(31)17-7-5-4-6-8-17)33-16-20(29(34)35)18-9-10-24(21(30)13-18)38-23-11-12-32-22-15-26(37-3)25(36-2)14-19(22)23/h4-16,27H,31H2,1-3H3
72 -9.64n/an/an/an/an/a7.522
Amgen
Assay Description
In vitro kinase assays were done to establish IC50 values against recombinant enzymes using homogeneous time-resolved fluorescence (HTRF) assay. For ...
J Med Chem 51: 5766-79 (2008)
Article DOI: 10.1021/jm8006189
BindingDB Entry DOI: 10.7270/Q23X84XN
Hepatocyte growth factor receptor
(Homo sapiens (Human))
BDBM24759
(2-[amino(phenyl)methyl]-5-{4-[(6,7-dimethoxyquinol...)
Show SMILES COc1cc2nccc(Oc3ccc(cc3F)-c3cnc(C(N)c4ccccc4)n(C)c3=O)c2cc1OC
Show InChI InChI=1S/C29H25FN4O4/c1-34-28(27(31)17-7-5-4-6-8-17)33-16-20(29(34)35)18-9-10-24(21(30)13-18)38-23-11-12-32-22-15-26(37-3)25(36-2)14-19(22)23/h4-16,27H,31H2,1-3H3
n/an/a 72n/an/an/an/an/an/a
Sichuan University
Curated by ChEMBL
Assay Description
Inhibition of human c-MET
Eur J Med Chem 46: 3675-80 (2011)
Article DOI: 10.1016/j.ejmech.2011.05.031
BindingDB Entry DOI: 10.7270/Q2891676