BDBM24772 2-[(4-fluorophenyl)amino]-5-[5-({6-methoxy-7-[3-(morpholin-4-yl)propoxy]quinolin-4-yl}oxy)pyridin-2-yl]-3-methyl-3,4-dihydropyrimidin-4-one::pyrimidone, 62
SMILES: COc1cc2c(Oc3ccc(nc3)-c3cnc(Nc4ccc(F)cc4)n(C)c3=O)ccnc2cc1OCCCN1CCOCC1
InChI Key: InChIKey=UVNDVSUMHWZESZ-UHFFFAOYSA-N
Data: 2 KI
Activity Spreadsheet -- Enzyme Inhibition Constant Data from BindingDB
Found 2 hits for monomerid = 24772
Trg + Lig
Ki
nM
ΔG°
kcal/mole
IC50
nM
Kd
nM
EC50/IC50
nM
koff
s-1
kon
M-1s-1
pHTemp
°C
Hepatocyte growth factor receptor
(Homo sapiens (Human))
BDBM24772
(2-[(4-fluorophenyl)amino]-5-[5-({6-methoxy-7-[3-(m...)
Show SMILES COc1cc2c(Oc3ccc(nc3)-c3cnc(Nc4ccc(F)cc4)n(C)c3=O)ccnc2cc1OCCCN1CCOCC1
Show InChI InChI=1S/C33H33FN6O5/c1-39-32(41)26(21-37-33(39)38-23-6-4-22(34)5-7-23)27-9-8-24(20-36-27)45-29-10-11-35-28-19-31(30(42-2)18-25(28)29)44-15-3-12-40-13-16-43-17-14-40/h4-11,18-21H,3,12-17H2,1-2H3,(H,37,38)
3.40 -11.4n/an/an/an/an/a7.522
Amgen
Assay Description
In vitro kinase assays were done to establish IC50 values against recombinant enzymes using homogeneous time-resolved fluorescence (HTRF) assay. For ...
J Med Chem 51: 5766-79 (2008)
Article DOI: 10.1021/jm8006189
BindingDB Entry DOI: 10.7270/Q23X84XN
Vascular endothelial growth factor receptor 2
(Homo sapiens (Human))
BDBM24772
(2-[(4-fluorophenyl)amino]-5-[5-({6-methoxy-7-[3-(m...)
Show SMILES COc1cc2c(Oc3ccc(nc3)-c3cnc(Nc4ccc(F)cc4)n(C)c3=O)ccnc2cc1OCCCN1CCOCC1
Show InChI InChI=1S/C33H33FN6O5/c1-39-32(41)26(21-37-33(39)38-23-6-4-22(34)5-7-23)27-9-8-24(20-36-27)45-29-10-11-35-28-19-31(30(42-2)18-25(28)29)44-15-3-12-40-13-16-43-17-14-40/h4-11,18-21H,3,12-17H2,1-2H3,(H,37,38)
NCI pathway
Reactome pathway
83 -9.56n/an/an/an/an/a7.522
Amgen
Assay Description
In vitro kinase assays were done to establish IC50 values against recombinant enzymes using homogeneous time-resolved fluorescence (HTRF) assay. For ...
J Med Chem 51: 5766-79 (2008)
Article DOI: 10.1021/jm8006189
BindingDB Entry DOI: 10.7270/Q23X84XN