BDBM24795 9-methoxy-2,2-dimethyl-2H,5H,10H-benzo[g]chromene-5,10-dione::Pyranonaphthoquinone derivative, 32
SMILES: COc1cccc2C(=O)C3=C(OC(C)(C)C=C3)C(=O)c12
InChI Key: InChIKey=LQAOFMNANKHBPH-UHFFFAOYSA-N
Data: 2 IC50
Activity Spreadsheet -- Enzyme Inhibition Constant Data from BindingDB
Found 2 hits for monomerid = 24795
Trg + Lig
Ki
nM
ΔG°
kcal/mole
IC50
nM
Kd
nM
EC50/IC50
nM
koff
s-1
kon
M-1s-1
pHTemp
°C
Indoleamine 2,3-dioxygenase
(Homo sapiens (Human))
BDBM24795
(9-methoxy-2,2-dimethyl-2H,5H,10H-benzo[g]chromene-...)
Show SMILES COc1cccc2C(=O)C3=C(OC(C)(C)C=C3)C(=O)c12 |c:15,t:9|
Show InChI InChI=1S/C16H14O4/c1-16(2)8-7-10-13(17)9-5-4-6-11(19-3)12(9)14(18)15(10)20-16/h4-8H,1-3H3
Reactome pathway
n/an/a 2.92E+3n/an/an/an/an/an/a
Gyeongsang National University
Curated by ChEMBL
Assay Description
Inhibition of 2,3 dioxygenase
Eur J Med Chem 45: 4004-12 (2010)
Article DOI: 10.1016/j.ejmech.2010.05.057
BindingDB Entry DOI: 10.7270/Q2HX1CW5
Indoleamine 2,3-dioxygenase
(Homo sapiens (Human))
BDBM24795
(9-methoxy-2,2-dimethyl-2H,5H,10H-benzo[g]chromene-...)
Show SMILES COc1cccc2C(=O)C3=C(OC(C)(C)C=C3)C(=O)c12 |c:15,t:9|
Show InChI InChI=1S/C16H14O4/c1-16(2)8-7-10-13(17)9-5-4-6-11(19-3)12(9)14(18)15(10)20-16/h4-8H,1-3H3
Reactome pathway
n/an/a 2.92E+3n/an/an/an/an/an/a
Bryn Mawr College
Assay Description
The IC50 inhibition assays were performed in a 96-well microtiter plate format using purified recombinant IDO, which was added to the substrate, L-tr...
J Med Chem 51: 1706-18 (2008)
Article DOI: 10.1021/jm7014155
BindingDB Entry DOI: 10.7270/Q2VD6WSV