null
SMILES: CSC(=S)NCCc1ccc(F)cc1
InChI Key: InChIKey=RVDLMTREYAFVQY-UHFFFAOYSA-N
Activity Spreadsheet -- Enzyme Inhibition Constant Data from BindingDB
Found 1 hit for monomerid = 24822
Trg + Lig
Ki
nM
ΔG°
kcal/mole
IC50
nM
Kd
nM
EC50/IC50
nM
koff
s-1
kon
M-1s-1
pHTemp
°C
Indoleamine 2,3-dioxygenase 1
(Homo sapiens (Human))
BDBM24822
(Brassinin derivative, 10 | N-[2-(4-fluorophenyl)et...)
Show SMILES CSC(=S)NCCc1ccc(F)cc1
Show InChI InChI=1S/C10H12FNS2/c1-14-10(13)12-7-6-8-2-4-9(11)5-3-8/h2-5H,6-7H2,1H3,(H,12,13)
Reactome pathway
1.49E+5 -5.43n/an/an/an/an/a6.537
Bryn Mawr College
Assay Description
The IC50 inhibition assays were performed in a 96-well microtiter plate format using purified recombinant IDO, which was added to the substrate, L-tr...
J Med Chem 49: 684-92 (2006)
Article DOI: 10.1021/jm0508888
BindingDB Entry DOI: 10.7270/Q2QR4VDZ