BDBM248576 US9434711, 489
SMILES: Cc1c(sc2ccccc12)N(Cc1ccc(F)c(Cl)c1)S(=O)(=O)c1ccc(cc1)C(O)=O
InChI Key: InChIKey=KESCNGKZZNTRET-UHFFFAOYSA-N
Data: 1 IC50
Activity Spreadsheet -- Enzyme Inhibition Constant Data from BindingDB
Found 1 hit for monomerid = 248576
Trg + Lig
Ki
nM
ΔG°
kcal/mole
IC50
nM
Kd
nM
EC50/IC50
nM
koff
s-1
kon
M-1s-1
pHTemp
°C
Transient receptor potential M8 protein (TRPM8)
(Canis lupus familiaris (Dog))
BDBM248576
(US9434711, 489)
Show SMILES Cc1c(sc2ccccc12)N(Cc1ccc(F)c(Cl)c1)S(=O)(=O)c1ccc(cc1)C(O)=O
Show InChI InChI=1S/C23H17ClFNO4S2/c1-14-18-4-2-3-5-21(18)31-22(14)26(13-15-6-11-20(25)19(24)12-15)32(29,30)17-9-7-16(8-10-17)23(27)28/h2-12H,13H2,1H3,(H,27,28)
US Patent
n/an/a 0.600n/an/an/an/an/a37
Janssen Pharmaceutica, N.V.
US Patent
Assay Description
The functional activity of compounds of the formula (I) was determined by measuring changes in intracellular calcium concentration using a Ca2+-sensi...
US Patent US9434711 (2016)
BindingDB Entry DOI: 10.7270/Q2H41QB6