BDBM248581 US9434711, 494
SMILES: Cc1c(sc2ccccc12)N(Cc1ccc(cc1)S(=O)(=O)C(F)(F)F)S(=O)(=O)c1ccc(cc1)C(O)=O
InChI Key: InChIKey=QJQZIAGMAJUEAO-UHFFFAOYSA-N
Data: 1 IC50
Activity Spreadsheet -- Enzyme Inhibition Constant Data from BindingDB
Found 1 hit for monomerid = 248581
Trg + Lig
Ki
nM
ΔG°
kcal/mole
IC50
nM
Kd
nM
EC50/IC50
nM
koff
s-1
kon
M-1s-1
pHTemp
°C
Transient receptor potential M8 protein (TRPM8)
(Canis lupus familiaris (Dog))
BDBM248581
(US9434711, 494)
Show SMILES Cc1c(sc2ccccc12)N(Cc1ccc(cc1)S(=O)(=O)C(F)(F)F)S(=O)(=O)c1ccc(cc1)C(O)=O
Show InChI InChI=1S/C24H18F3NO6S3/c1-15-20-4-2-3-5-21(20)35-22(15)28(37(33,34)19-12-8-17(9-13-19)23(29)30)14-16-6-10-18(11-7-16)36(31,32)24(25,26)27/h2-13H,14H2,1H3,(H,29,30)
US Patent
n/an/a 0.900n/an/an/an/an/a37
Janssen Pharmaceutica, N.V.
US Patent
Assay Description
The functional activity of compounds of the formula (I) was determined by measuring changes in intracellular calcium concentration using a Ca2+-sensi...
US Patent US9434711 (2016)
BindingDB Entry DOI: 10.7270/Q2H41QB6