null
SMILES: Cc1c(sc2ccccc12)N(Cc1ccc(cc1)C(F)(F)F)S(=O)(=O)c1ccc(cc1)C(O)=O
InChI Key: InChIKey=OYZDEXWVRPUJBG-UHFFFAOYSA-N
Activity Spreadsheet -- Enzyme Inhibition Constant Data from BindingDB
Found 1 hit for monomerid = 248599
Trg + Lig
Ki
nM
ΔG°
kcal/mole
IC50
nM
Kd
nM
EC50/IC50
nM
koff
s-1
kon
M-1s-1
pHTemp
°C
Transient receptor potential M8 protein
(Canis lupus familiaris (Dog))
BDBM248599
(US9434711, 518)
Show SMILES Cc1c(sc2ccccc12)N(Cc1ccc(cc1)C(F)(F)F)S(=O)(=O)c1ccc(cc1)C(O)=O
Show InChI InChI=1S/C24H18F3NO4S2/c1-15-20-4-2-3-5-21(20)33-22(15)28(14-16-6-10-18(11-7-16)24(25,26)27)34(31,32)19-12-8-17(9-13-19)23(29)30/h2-13H,14H2,1H3,(H,29,30)
US Patent
n/an/a 0.700n/an/an/an/an/a37
Janssen Pharmaceutica, N.V.
US Patent
Assay Description
The functional activity of compounds of the formula (I) was determined by measuring changes in intracellular calcium concentration using a Ca2+-sensi...
US Patent US9434711 (2016)
BindingDB Entry DOI: 10.7270/Q2H41QB6