BDBM249137 US9453038, 15
SMILES: COC(=O)CCc1ccc(nc1)-c1cc2cc(Oc3ccc(cc3)S(C)(=O)=O)c(cc2[nH]1)C1CCC(=O)N1C
InChI Key:
Data: 2 EC50
Activity Spreadsheet -- Enzyme Inhibition Constant Data from BindingDB
Found 2 hits for monomerid = 249137
Trg + Lig
Ki
nM
ΔG°
kcal/mole
IC50
nM
Kd
nM
EC50/IC50
nM
koff
s-1
kon
M-1s-1
pHTemp
°C
Glucokinase/Glucokinase regulatory protein
(Homo sapiens (Human))
BDBM249137
(US9453038, 15)
Show SMILES COC(=O)CCc1ccc(nc1)-c1cc2cc(Oc3ccc(cc3)S(C)(=O)=O)c(cc2[nH]1)C1CCC(=O)N1C
NCI pathway
Reactome pathway
US Patent
n/an/an/an/a 24.6n/an/an/a30
Merck Sharp & Dohme Corp.
US Patent
Assay Description
To test the exemplified compounds, the following assay was employed. Recombinant human liver glucokinase was expressed as a FLAG fusion protein in E....
US Patent US9453038 (2016)
BindingDB Entry DOI: 10.7270/Q23X85KK
Glucokinase/Glucokinase regulatory protein
(Homo sapiens (Human))
BDBM249137
(US9453038, 15)
Show SMILES COC(=O)CCc1ccc(nc1)-c1cc2cc(Oc3ccc(cc3)S(C)(=O)=O)c(cc2[nH]1)C1CCC(=O)N1C
NCI pathway
Reactome pathway
US Patent
n/an/an/an/a 3.80n/an/an/a30
Merck Sharp & Dohme Corp.
US Patent
Assay Description
To test the exemplified compounds, the following assay was employed. Recombinant human liver glucokinase was expressed as a FLAG fusion protein in E....
US Patent US9453038 (2016)
BindingDB Entry DOI: 10.7270/Q23X85KK