BDBM2492 US8507510, 1.25::US8507510, 1.27
SMILES: COc1cc(Nc2ncc(Br)c(N[C@H](C)[C@H](C)O)n2)ccc1S(C)(=N)=O
InChI Key: InChIKey=GNODSQUZRSUVER-QILFFNKJSA-N
Data: 6 IC50
Activity Spreadsheet -- Enzyme Inhibition Constant Data from BindingDB
Found 6 hits for monomerid = 2492
Trg + Lig
Ki
nM
ΔG°
kcal/mole
IC50
nM
Kd
nM
EC50/IC50
nM
koff
s-1
kon
M-1s-1
pHTemp
°C
Cyclin-dependent kinase 2
(Homo sapiens (Human))
BDBM2492
(US8507510, 1.25 | US8507510, 1.27)
Show SMILES COc1cc(Nc2ncc(Br)c(N[C@H](C)[C@H](C)O)n2)ccc1S(C)(=N)=O |r|
Show InChI InChI=1S/C16H22BrN5O3S/c1-9(10(2)23)20-15-12(17)8-19-16(22-15)21-11-5-6-14(26(4,18)24)13(7-11)25-3/h5-10,18,23H,1-4H3,(H2,19,20,21,22)/t9-,10+,26?/m1/s1
NCI pathway
Reactome pathway
US Patent
n/an/a 4n/an/an/an/an/an/a
Bayer Intellectual Property GmbH
US Patent
Assay Description
Kinase assay using either CDK1, CDK2 or VEGFR-2.
US Patent US8507510 (2013)
BindingDB Entry DOI: 10.7270/Q2V69H76
Cyclin-dependent kinase 1
(Homo sapiens (Human))
BDBM2492
(US8507510, 1.25 | US8507510, 1.27)
Show SMILES COc1cc(Nc2ncc(Br)c(N[C@H](C)[C@H](C)O)n2)ccc1S(C)(=N)=O |r|
Show InChI InChI=1S/C16H22BrN5O3S/c1-9(10(2)23)20-15-12(17)8-19-16(22-15)21-11-5-6-14(26(4,18)24)13(7-11)25-3/h5-10,18,23H,1-4H3,(H2,19,20,21,22)/t9-,10+,26?/m1/s1
Reactome pathway
US Patent
n/an/a 3n/an/an/an/an/an/a
Bayer Intellectual Property GmbH
US Patent
Assay Description
Kinase assay using either CDK1, CDK2 or VEGFR-2.
US Patent US8507510 (2013)
BindingDB Entry DOI: 10.7270/Q2V69H76
Vascular endothelial growth factor receptor 2
(Homo sapiens (Human))
BDBM2492
(US8507510, 1.25 | US8507510, 1.27)
Show SMILES COc1cc(Nc2ncc(Br)c(N[C@H](C)[C@H](C)O)n2)ccc1S(C)(=N)=O |r|
Show InChI InChI=1S/C16H22BrN5O3S/c1-9(10(2)23)20-15-12(17)8-19-16(22-15)21-11-5-6-14(26(4,18)24)13(7-11)25-3/h5-10,18,23H,1-4H3,(H2,19,20,21,22)/t9-,10+,26?/m1/s1
NCI pathway
Reactome pathway
US Patent
n/an/a 70n/an/an/an/an/an/a
Bayer Intellectual Property GmbH
US Patent
Assay Description
Kinase assay using either CDK1, CDK2 or VEGFR-2.
US Patent US8507510 (2013)
BindingDB Entry DOI: 10.7270/Q2V69H76
Cyclin-dependent kinase 2
(Homo sapiens (Human))
BDBM2492
(US8507510, 1.25 | US8507510, 1.27)
Show SMILES COc1cc(Nc2ncc(Br)c(N[C@H](C)[C@H](C)O)n2)ccc1S(C)(=N)=O |r|
Show InChI InChI=1S/C16H22BrN5O3S/c1-9(10(2)23)20-15-12(17)8-19-16(22-15)21-11-5-6-14(26(4,18)24)13(7-11)25-3/h5-10,18,23H,1-4H3,(H2,19,20,21,22)/t9-,10+,26?/m1/s1
NCI pathway
Reactome pathway
US Patent
n/an/a 3n/an/an/an/an/an/a
Bayer Intellectual Property GmbH
US Patent
Assay Description
Kinase assay using either CDK1, CDK2 or VEGFR-2.
US Patent US8507510 (2013)
BindingDB Entry DOI: 10.7270/Q2V69H76
Cyclin-dependent kinase 1
(Homo sapiens (Human))
BDBM2492
(US8507510, 1.25 | US8507510, 1.27)
Show SMILES COc1cc(Nc2ncc(Br)c(N[C@H](C)[C@H](C)O)n2)ccc1S(C)(=N)=O |r|
Show InChI InChI=1S/C16H22BrN5O3S/c1-9(10(2)23)20-15-12(17)8-19-16(22-15)21-11-5-6-14(26(4,18)24)13(7-11)25-3/h5-10,18,23H,1-4H3,(H2,19,20,21,22)/t9-,10+,26?/m1/s1
Reactome pathway
US Patent
n/an/a 2n/an/an/an/an/an/a
Bayer Intellectual Property GmbH
US Patent
Assay Description
Kinase assay using either CDK1, CDK2 or VEGFR-2.
US Patent US8507510 (2013)
BindingDB Entry DOI: 10.7270/Q2V69H76
Vascular endothelial growth factor receptor 2
(Homo sapiens (Human))
BDBM2492
(US8507510, 1.25 | US8507510, 1.27)
Show SMILES COc1cc(Nc2ncc(Br)c(N[C@H](C)[C@H](C)O)n2)ccc1S(C)(=N)=O |r|
Show InChI InChI=1S/C16H22BrN5O3S/c1-9(10(2)23)20-15-12(17)8-19-16(22-15)21-11-5-6-14(26(4,18)24)13(7-11)25-3/h5-10,18,23H,1-4H3,(H2,19,20,21,22)/t9-,10+,26?/m1/s1
NCI pathway
Reactome pathway
US Patent
n/an/a 97n/an/an/an/an/an/a
Bayer Intellectual Property GmbH
US Patent
Assay Description
Kinase assay using either CDK1, CDK2 or VEGFR-2.
US Patent US8507510 (2013)
BindingDB Entry DOI: 10.7270/Q2V69H76