BDBM249490 US10072016, Compound 88::US10407433, Compound 88::US10913746, Compound 88::US9434727, 88::US9777010, Compound 88
SMILES: Fc1ccc(C2CCN(CC2)C(=O)c2n[nH]c3CCN(CC4CC4)Cc23)c(c1F)C(F)(F)F
InChI Key: InChIKey=LLZJRMIXDPBPBN-UHFFFAOYSA-N
Data: 14 IC50
Activity Spreadsheet -- Enzyme Inhibition Constant Data from BindingDB
Found 14 hits for monomerid = 249490
Trg + Lig
Ki
nM
ΔG°
kcal/mole
IC50
nM
Kd
nM
EC50/IC50
nM
koff
s-1
kon
M-1s-1
pHTemp
°C
Retinol-binding protein 4
(Homo sapiens (Human))
BDBM249490
(US10072016, Compound 88 | US10407433, Compound 88 ...)
Show SMILES Fc1ccc(C2CCN(CC2)C(=O)c2n[nH]c3CCN(CC4CC4)Cc23)c(c1F)C(F)(F)F
Show InChI InChI=1S/C23H25F5N4O/c24-17-4-3-15(19(20(17)25)23(26,27)28)14-5-9-32(10-6-14)22(33)21-16-12-31(11-13-1-2-13)8-7-18(16)29-30-21/h3-4,13-14H,1-2,5-12H2,(H,29,30)
Reactome pathway
US Patent
n/an/a 14.7n/an/an/an/a7.44
THE TRUSTEES OF COLUMBIA UNIVERSITY IN THE CITY OF NEW YORK
US Patent
Assay Description
Untagged human RBP4 purified from urine of tubular proteinuria patients was purchased from Fitzgerald Industries International. It was biotinylated u...
US Patent US9434727 (2016)
BindingDB Entry DOI: 10.7270/Q2F76BGR
Retinol-binding protein 4
(Homo sapiens (Human))
BDBM249490
(US10072016, Compound 88 | US10407433, Compound 88 ...)
Show SMILES Fc1ccc(C2CCN(CC2)C(=O)c2n[nH]c3CCN(CC4CC4)Cc23)c(c1F)C(F)(F)F
Show InChI InChI=1S/C23H25F5N4O/c24-17-4-3-15(19(20(17)25)23(26,27)28)14-5-9-32(10-6-14)22(33)21-16-12-31(11-13-1-2-13)8-7-18(16)29-30-21/h3-4,13-14H,1-2,5-12H2,(H,29,30)
Reactome pathway
US Patent
n/an/a 13.4n/an/an/an/a7.44
THE TRUSTEES OF COLUMBIA UNIVERSITY IN THE CITY OF NEW YORK
US Patent
Assay Description
Untagged human RBP4 purified from urine of tubular proteinuria patients was purchased from Fitzgerald Industries International. It was biotinylated u...
US Patent US9434727 (2016)
BindingDB Entry DOI: 10.7270/Q2F76BGR
Retinol-binding protein 4
(Homo sapiens (Human))
BDBM249490
(US10072016, Compound 88 | US10407433, Compound 88 ...)
Show SMILES Fc1ccc(C2CCN(CC2)C(=O)c2n[nH]c3CCN(CC4CC4)Cc23)c(c1F)C(F)(F)F
Show InChI InChI=1S/C23H25F5N4O/c24-17-4-3-15(19(20(17)25)23(26,27)28)14-5-9-32(10-6-14)22(33)21-16-12-31(11-13-1-2-13)8-7-18(16)29-30-21/h3-4,13-14H,1-2,5-12H2,(H,29,30)
Reactome pathway
US Patent
n/an/a 18.0n/an/an/an/a7.54
THE TRUSTEES OF COLUMBIA UNIVERSITY IN THE CITY OF NEW YORK
US Patent
Assay Description
TR-FRET assay for retinol-induced RBP4-TTR interaction Binding of a desired RBP4 antagonist displaces retinol and induces hindrance for RBP4-TTR inte...
US Patent US9434727 (2016)
BindingDB Entry DOI: 10.7270/Q2F76BGR
Retinol-binding protein 4
(Homo sapiens (Human))
BDBM249490
(US10072016, Compound 88 | US10407433, Compound 88 ...)
Show SMILES Fc1ccc(C2CCN(CC2)C(=O)c2n[nH]c3CCN(CC4CC4)Cc23)c(c1F)C(F)(F)F
Show InChI InChI=1S/C23H25F5N4O/c24-17-4-3-15(19(20(17)25)23(26,27)28)14-5-9-32(10-6-14)22(33)21-16-12-31(11-13-1-2-13)8-7-18(16)29-30-21/h3-4,13-14H,1-2,5-12H2,(H,29,30)
Reactome pathway
US Patent
n/an/a 39.0n/an/an/an/a7.54
THE TRUSTEES OF COLUMBIA UNIVERSITY IN THE CITY OF NEW YORK
US Patent
Assay Description
TR-FRET assay for retinol-induced RBP4-TTR interaction Binding of a desired RBP4 antagonist displaces retinol and induces hindrance for RBP4-TTR inte...
US Patent US9434727 (2016)
BindingDB Entry DOI: 10.7270/Q2F76BGR
Retinol-binding protein 4
(Homo sapiens (Human))
BDBM249490
(US10072016, Compound 88 | US10407433, Compound 88 ...)
Show SMILES Fc1ccc(C2CCN(CC2)C(=O)c2n[nH]c3CCN(CC4CC4)Cc23)c(c1F)C(F)(F)F
Show InChI InChI=1S/C23H25F5N4O/c24-17-4-3-15(19(20(17)25)23(26,27)28)14-5-9-32(10-6-14)22(33)21-16-12-31(11-13-1-2-13)8-7-18(16)29-30-21/h3-4,13-14H,1-2,5-12H2,(H,29,30)
Reactome pathway
US Patent
n/an/a 14.7n/an/an/an/a7.5n/a
THE TRUSTEES OF COLUMBIA UNIVERSITY IN THE CITY OF NEW YORK
US Patent
Assay Description
Binding of a desired RBP4 antagonist displaces retinol and induces hindrance for RBP4-TTR interaction resulting in the decreased FRET signal (FIG. 7)...
US Patent US10072016 (2018)
BindingDB Entry DOI: 10.7270/Q2QJ7KBT
Transthyretin
(Homo sapiens (Human))
BDBM249490
(US10072016, Compound 88 | US10407433, Compound 88 ...)
Show SMILES Fc1ccc(C2CCN(CC2)C(=O)c2n[nH]c3CCN(CC4CC4)Cc23)c(c1F)C(F)(F)F
Show InChI InChI=1S/C23H25F5N4O/c24-17-4-3-15(19(20(17)25)23(26,27)28)14-5-9-32(10-6-14)22(33)21-16-12-31(11-13-1-2-13)8-7-18(16)29-30-21/h3-4,13-14H,1-2,5-12H2,(H,29,30)
US Patent
n/an/a 18n/an/an/an/a7.425
THE TRUSTEES OF COLUMBIA UNIVERSITY IN THE CITY OF NEW YORK
US Patent
Assay Description
Untagged human RBP4 purified from urine of tubular proteinuria patients was purchased from Fitzgerald Industries International. It was biotinylated u...
US Patent US10072016 (2018)
BindingDB Entry DOI: 10.7270/Q2QJ7KBT
Retinol-binding protein 4
(Homo sapiens (Human))
BDBM249490
(US10072016, Compound 88 | US10407433, Compound 88 ...)
Show SMILES Fc1ccc(C2CCN(CC2)C(=O)c2n[nH]c3CCN(CC4CC4)Cc23)c(c1F)C(F)(F)F
Show InChI InChI=1S/C23H25F5N4O/c24-17-4-3-15(19(20(17)25)23(26,27)28)14-5-9-32(10-6-14)22(33)21-16-12-31(11-13-1-2-13)8-7-18(16)29-30-21/h3-4,13-14H,1-2,5-12H2,(H,29,30)
Reactome pathway
US Patent
n/an/a 13.4n/an/an/an/an/an/a
The Trustees of Columbia University in the City of New York
US Patent
Assay Description
Untagged human RBP4 purified from urine of tubular proteinuria patients was purchased from Fitzgerald Industries International. It was biotinylated u...
US Patent US10913746 (2021)
Transthyretin
(Homo sapiens (Human))
BDBM249490
(US10072016, Compound 88 | US10407433, Compound 88 ...)
Show SMILES Fc1ccc(C2CCN(CC2)C(=O)c2n[nH]c3CCN(CC4CC4)Cc23)c(c1F)C(F)(F)F
Show InChI InChI=1S/C23H25F5N4O/c24-17-4-3-15(19(20(17)25)23(26,27)28)14-5-9-32(10-6-14)22(33)21-16-12-31(11-13-1-2-13)8-7-18(16)29-30-21/h3-4,13-14H,1-2,5-12H2,(H,29,30)
US Patent
n/an/a 39n/an/an/an/a7.425
THE TRUSTEES OF COLUMBIA UNIVERSITY IN THE CITY OF NEW YORK
US Patent
Assay Description
Untagged human RBP4 purified from urine of tubular proteinuria patients was purchased from Fitzgerald Industries International. It was biotinylated u...
US Patent US10072016 (2018)
BindingDB Entry DOI: 10.7270/Q2QJ7KBT
Retinol-binding protein 4
(Homo sapiens (Human))
BDBM249490
(US10072016, Compound 88 | US10407433, Compound 88 ...)
Show SMILES Fc1ccc(C2CCN(CC2)C(=O)c2n[nH]c3CCN(CC4CC4)Cc23)c(c1F)C(F)(F)F
Show InChI InChI=1S/C23H25F5N4O/c24-17-4-3-15(19(20(17)25)23(26,27)28)14-5-9-32(10-6-14)22(33)21-16-12-31(11-13-1-2-13)8-7-18(16)29-30-21/h3-4,13-14H,1-2,5-12H2,(H,29,30)
Reactome pathway
US Patent
n/an/a 14.7n/an/an/an/an/an/a
THE TRUSTEES OF COLUMBIA UNIVERSITY IN THE CITY OF NEW YORK
US Patent
Assay Description
Untagged human RBP4 purified from urine of tubular proteinuria patients was purchased from Fitzgerald Industries International. It was biotinylated u...
US Patent US9777010 (2017)
BindingDB Entry DOI: 10.7270/Q22J6F0D
Retinol-binding protein 4
(Homo sapiens (Human))
BDBM249490
(US10072016, Compound 88 | US10407433, Compound 88 ...)
Show SMILES Fc1ccc(C2CCN(CC2)C(=O)c2n[nH]c3CCN(CC4CC4)Cc23)c(c1F)C(F)(F)F
Show InChI InChI=1S/C23H25F5N4O/c24-17-4-3-15(19(20(17)25)23(26,27)28)14-5-9-32(10-6-14)22(33)21-16-12-31(11-13-1-2-13)8-7-18(16)29-30-21/h3-4,13-14H,1-2,5-12H2,(H,29,30)
Reactome pathway
US Patent
n/an/a 13.4n/an/an/an/an/an/a
THE TRUSTEES OF COLUMBIA UNIVERSITY IN THE CITY OF NEW YORK
US Patent
Assay Description
Untagged human RBP4 purified from urine of tubular proteinuria patients was purchased from Fitzgerald Industries International. It was biotinylated u...
US Patent US9777010 (2017)
BindingDB Entry DOI: 10.7270/Q22J6F0D
Retinol-binding protein 4
(Homo sapiens (Human))
BDBM249490
(US10072016, Compound 88 | US10407433, Compound 88 ...)
Show SMILES Fc1ccc(C2CCN(CC2)C(=O)c2n[nH]c3CCN(CC4CC4)Cc23)c(c1F)C(F)(F)F
Show InChI InChI=1S/C23H25F5N4O/c24-17-4-3-15(19(20(17)25)23(26,27)28)14-5-9-32(10-6-14)22(33)21-16-12-31(11-13-1-2-13)8-7-18(16)29-30-21/h3-4,13-14H,1-2,5-12H2,(H,29,30)
Reactome pathway
US Patent
n/an/a 14.7n/an/an/an/an/an/a
The Trustees of Columbia University In The City of New York
US Patent
Assay Description
Untagged human RBP4 purified from urine of tubular proteinuria patients was purchased from Fitzgerald Industries International. It was biotinylated u...
US Patent US10407433 (2019)
BindingDB Entry DOI: 10.7270/Q2W95CKV
Retinol-binding protein 4
(Homo sapiens (Human))
BDBM249490
(US10072016, Compound 88 | US10407433, Compound 88 ...)
Show SMILES Fc1ccc(C2CCN(CC2)C(=O)c2n[nH]c3CCN(CC4CC4)Cc23)c(c1F)C(F)(F)F
Show InChI InChI=1S/C23H25F5N4O/c24-17-4-3-15(19(20(17)25)23(26,27)28)14-5-9-32(10-6-14)22(33)21-16-12-31(11-13-1-2-13)8-7-18(16)29-30-21/h3-4,13-14H,1-2,5-12H2,(H,29,30)
Reactome pathway
US Patent
n/an/a 13.4n/an/an/an/an/an/a
The Trustees of Columbia University In The City of New York
US Patent
Assay Description
Untagged human RBP4 purified from urine of tubular proteinuria patients was purchased from Fitzgerald Industries International. It was biotinylated u...
US Patent US10407433 (2019)
BindingDB Entry DOI: 10.7270/Q2W95CKV
Retinol-binding protein 4
(Homo sapiens (Human))
BDBM249490
(US10072016, Compound 88 | US10407433, Compound 88 ...)
Show SMILES Fc1ccc(C2CCN(CC2)C(=O)c2n[nH]c3CCN(CC4CC4)Cc23)c(c1F)C(F)(F)F
Show InChI InChI=1S/C23H25F5N4O/c24-17-4-3-15(19(20(17)25)23(26,27)28)14-5-9-32(10-6-14)22(33)21-16-12-31(11-13-1-2-13)8-7-18(16)29-30-21/h3-4,13-14H,1-2,5-12H2,(H,29,30)
Reactome pathway
US Patent
n/an/a 14.7n/an/an/an/an/an/a
The Trustees of Columbia University in the City of New York
US Patent
Assay Description
Untagged human RBP4 purified from urine of tubular proteinuria patients was purchased from Fitzgerald Industries International. It was biotinylated u...
US Patent US10913746 (2021)
Retinol-binding protein 4
(Homo sapiens (Human))
BDBM249490
(US10072016, Compound 88 | US10407433, Compound 88 ...)
Show SMILES Fc1ccc(C2CCN(CC2)C(=O)c2n[nH]c3CCN(CC4CC4)Cc23)c(c1F)C(F)(F)F
Show InChI InChI=1S/C23H25F5N4O/c24-17-4-3-15(19(20(17)25)23(26,27)28)14-5-9-32(10-6-14)22(33)21-16-12-31(11-13-1-2-13)8-7-18(16)29-30-21/h3-4,13-14H,1-2,5-12H2,(H,29,30)
Reactome pathway
US Patent
n/an/a 13.4n/an/an/an/a7.5n/a
THE TRUSTEES OF COLUMBIA UNIVERSITY IN THE CITY OF NEW YORK
US Patent
Assay Description
Binding of a desired RBP4 antagonist displaces retinol and induces hindrance for RBP4-TTR interaction resulting in the decreased FRET signal (FIG. 7)...
US Patent US10072016 (2018)
BindingDB Entry DOI: 10.7270/Q2QJ7KBT