null
SMILES: Fc1ccc(C2CCN(CC2)C(=O)c2nnc3ccc(cn23)C#N)c(c1)C(F)(F)F
InChI Key: InChIKey=XEPOCPGPNGGIJI-UHFFFAOYSA-N
Activity Spreadsheet -- Enzyme Inhibition Constant Data from BindingDB
Found 8 hits for monomerid = 249562
Trg + Lig
Ki
nM
ΔG°
kcal/mole
IC50
nM
Kd
nM
EC50/IC50
nM
koff
s-1
kon
M-1s-1
pHTemp
°C
Retinol-binding protein 4
(Homo sapiens (Human))
BDBM249562
(US10072016, Compound 160 | US10407433, Compound 16...)
Show SMILES Fc1ccc(C2CCN(CC2)C(=O)c2nnc3ccc(cn23)C#N)c(c1)C(F)(F)F
Show InChI InChI=1S/C20H15F4N5O/c21-14-2-3-15(16(9-14)20(22,23)24)13-5-7-28(8-6-13)19(30)18-27-26-17-4-1-12(10-25)11-29(17)18/h1-4,9,11,13H,5-8H2
Reactome pathway
US Patent
n/an/a 9.06n/an/an/an/a7.44
THE TRUSTEES OF COLUMBIA UNIVERSITY IN THE CITY OF NEW YORK
US Patent
Assay Description
Untagged human RBP4 purified from urine of tubular proteinuria patients was purchased from Fitzgerald Industries International. It was biotinylated u...
US Patent US9434727 (2016)
BindingDB Entry DOI: 10.7270/Q2F76BGR
Retinol-binding protein 4
(Homo sapiens (Human))
BDBM249562
(US10072016, Compound 160 | US10407433, Compound 16...)
Show SMILES Fc1ccc(C2CCN(CC2)C(=O)c2nnc3ccc(cn23)C#N)c(c1)C(F)(F)F
Show InChI InChI=1S/C20H15F4N5O/c21-14-2-3-15(16(9-14)20(22,23)24)13-5-7-28(8-6-13)19(30)18-27-26-17-4-1-12(10-25)11-29(17)18/h1-4,9,11,13H,5-8H2
Reactome pathway
US Patent
n/an/a 19.8n/an/an/an/a7.54
THE TRUSTEES OF COLUMBIA UNIVERSITY IN THE CITY OF NEW YORK
US Patent
Assay Description
TR-FRET assay for retinol-induced RBP4-TTR interaction Binding of a desired RBP4 antagonist displaces retinol and induces hindrance for RBP4-TTR inte...
US Patent US9434727 (2016)
BindingDB Entry DOI: 10.7270/Q2F76BGR
Retinol-binding protein 4
(Homo sapiens (Human))
BDBM249562
(US10072016, Compound 160 | US10407433, Compound 16...)
Show SMILES Fc1ccc(C2CCN(CC2)C(=O)c2nnc3ccc(cn23)C#N)c(c1)C(F)(F)F
Show InChI InChI=1S/C20H15F4N5O/c21-14-2-3-15(16(9-14)20(22,23)24)13-5-7-28(8-6-13)19(30)18-27-26-17-4-1-12(10-25)11-29(17)18/h1-4,9,11,13H,5-8H2
Reactome pathway
US Patent
n/an/a 9.06n/an/an/an/a7.5n/a
THE TRUSTEES OF COLUMBIA UNIVERSITY IN THE CITY OF NEW YORK
US Patent
Assay Description
Binding of a desired RBP4 antagonist displaces retinol and induces hindrance for RBP4-TTR interaction resulting in the decreased FRET signal (FIG. 7)...
US Patent US10072016 (2018)
BindingDB Entry DOI: 10.7270/Q2QJ7KBT
Retinol-binding protein 4
(Homo sapiens (Human))
BDBM249562
(US10072016, Compound 160 | US10407433, Compound 16...)
Show SMILES Fc1ccc(C2CCN(CC2)C(=O)c2nnc3ccc(cn23)C#N)c(c1)C(F)(F)F
Show InChI InChI=1S/C20H15F4N5O/c21-14-2-3-15(16(9-14)20(22,23)24)13-5-7-28(8-6-13)19(30)18-27-26-17-4-1-12(10-25)11-29(17)18/h1-4,9,11,13H,5-8H2
Reactome pathway
US Patent
n/an/a 9.06n/an/an/an/an/an/a
The Trustees of Columbia University in the City of New York
US Patent
Assay Description
Untagged human RBP4 purified from urine of tubular proteinuria patients was purchased from Fitzgerald Industries International. It was biotinylated u...
US Patent US10913746 (2021)
BindingDB Entry DOI: 10.7270/Q2HX1GS2
Retinol-binding protein 4
(Homo sapiens (Human))
BDBM249562
(US10072016, Compound 160 | US10407433, Compound 16...)
Show SMILES Fc1ccc(C2CCN(CC2)C(=O)c2nnc3ccc(cn23)C#N)c(c1)C(F)(F)F
Show InChI InChI=1S/C20H15F4N5O/c21-14-2-3-15(16(9-14)20(22,23)24)13-5-7-28(8-6-13)19(30)18-27-26-17-4-1-12(10-25)11-29(17)18/h1-4,9,11,13H,5-8H2
Reactome pathway
US Patent
n/an/a 9.06n/an/an/an/an/an/a
THE TRUSTEES OF COLUMBIA UNIVERSITY IN THE CITY OF NEW YORK
US Patent
Assay Description
Untagged human RBP4 purified from urine of tubular proteinuria patients was purchased from Fitzgerald Industries International. It was biotinylated u...
US Patent US9777010 (2017)
BindingDB Entry DOI: 10.7270/Q22J6F0D
Retinol-binding protein 4
(Homo sapiens (Human))
BDBM249562
(US10072016, Compound 160 | US10407433, Compound 16...)
Show SMILES Fc1ccc(C2CCN(CC2)C(=O)c2nnc3ccc(cn23)C#N)c(c1)C(F)(F)F
Show InChI InChI=1S/C20H15F4N5O/c21-14-2-3-15(16(9-14)20(22,23)24)13-5-7-28(8-6-13)19(30)18-27-26-17-4-1-12(10-25)11-29(17)18/h1-4,9,11,13H,5-8H2
Reactome pathway
US Patent
n/an/a 9.06n/an/an/an/an/an/a
The Trustees of Columbia University In The City of New York
US Patent
Assay Description
Untagged human RBP4 purified from urine of tubular proteinuria patients was purchased from Fitzgerald Industries International. It was biotinylated u...
US Patent US10407433 (2019)
BindingDB Entry DOI: 10.7270/Q2W95CKV
Retinol-binding protein 4
(Homo sapiens (Human))
BDBM249562
(US10072016, Compound 160 | US10407433, Compound 16...)
Show SMILES Fc1ccc(C2CCN(CC2)C(=O)c2nnc3ccc(cn23)C#N)c(c1)C(F)(F)F
Show InChI InChI=1S/C20H15F4N5O/c21-14-2-3-15(16(9-14)20(22,23)24)13-5-7-28(8-6-13)19(30)18-27-26-17-4-1-12(10-25)11-29(17)18/h1-4,9,11,13H,5-8H2
Reactome pathway
n/an/a 9.10n/an/an/an/an/an/a
Albany College of Pharmacy and Health Sciences
Curated by ChEMBL
Assay Description
Competitive displacement of 3[H]retinol from biotinylated RBP4 (unknown origin) by surface plasmon resonance analysis
J Med Chem 62: 5470-5500 (2019)
Article DOI: 10.1021/acs.jmedchem.9b00352
BindingDB Entry DOI: 10.7270/Q290272Z
Transthyretin
(Homo sapiens (Human))
BDBM249562
(US10072016, Compound 160 | US10407433, Compound 16...)
Show SMILES Fc1ccc(C2CCN(CC2)C(=O)c2nnc3ccc(cn23)C#N)c(c1)C(F)(F)F
Show InChI InChI=1S/C20H15F4N5O/c21-14-2-3-15(16(9-14)20(22,23)24)13-5-7-28(8-6-13)19(30)18-27-26-17-4-1-12(10-25)11-29(17)18/h1-4,9,11,13H,5-8H2
US Patent
n/an/a 19.8n/an/an/an/a7.425
THE TRUSTEES OF COLUMBIA UNIVERSITY IN THE CITY OF NEW YORK
US Patent
Assay Description
Untagged human RBP4 purified from urine of tubular proteinuria patients was purchased from Fitzgerald Industries International. It was biotinylated u...
US Patent US10072016 (2018)
BindingDB Entry DOI: 10.7270/Q2QJ7KBT