null
SMILES: COc1cc(CN(CC2CCCC2)[C@@H](CC(O)=O)c2ccc(Cl)c(F)c2)ccc1OCCN1C(=O)CCC1=O
InChI Key: InChIKey=LXOTZCOUDJLRKL-DEOSSOPVSA-N
Activity Spreadsheet -- Enzyme Inhibition Constant Data from BindingDB
Found 2 hits for monomerid = 249589
Trg + Lig
Ki
nM
ΔG°
kcal/mole
IC50
nM
Kd
nM
EC50/IC50
nM
koff
s-1
kon
M-1s-1
pHTemp
°C
C-X-C chemokine receptor type 3
(Homo sapiens (Human))
BDBM249589
(US9447038, 17)
Show SMILES COc1cc(CN(CC2CCCC2)[C@@H](CC(O)=O)c2ccc(Cl)c(F)c2)ccc1OCCN1C(=O)CCC1=O |r|
Show InChI InChI=1S/C29H34ClFN2O6/c1-38-26-14-20(6-9-25(26)39-13-12-33-27(34)10-11-28(33)35)18-32(17-19-4-2-3-5-19)24(16-29(36)37)21-7-8-22(30)23(31)15-21/h6-9,14-15,19,24H,2-5,10-13,16-18H2,1H3,(H,36,37)/t24-/m0/s1
n/an/a 54n/an/an/an/an/an/a
Sanofi Co. Ltd
Curated by ChEMBL
Assay Description
Displacement of [125I]-CXCL10 from human recombinant CXCR3 transfected in Flp-In-CHO cell membranes after 60 mins by gamma counting method
Bioorg Med Chem Lett 26: 5429-5437 (2016)
Article DOI: 10.1016/j.bmcl.2016.10.038
BindingDB Entry DOI: 10.7270/Q2514164
C-X-C motif chemokine 10
(Homo sapiens (Human))
BDBM249589
(US9447038, 17)
Show SMILES COc1cc(CN(CC2CCCC2)[C@@H](CC(O)=O)c2ccc(Cl)c(F)c2)ccc1OCCN1C(=O)CCC1=O |r|
Show InChI InChI=1S/C29H34ClFN2O6/c1-38-26-14-20(6-9-25(26)39-13-12-33-27(34)10-11-28(33)35)18-32(17-19-4-2-3-5-19)24(16-29(36)37)21-7-8-22(30)23(31)15-21/h6-9,14-15,19,24H,2-5,10-13,16-18H2,1H3,(H,36,37)/t24-/m0/s1
US Patent
n/an/a 54n/an/an/an/an/a25
Sanofi
US Patent
Assay Description
The composition of the binding assay buffer is determined in a course of detailed optimization procedure. This resulted in a binding assay buffer con...
US Patent US9447038 (2016)
BindingDB Entry DOI: 10.7270/Q29G5KQK