BDBM24990 2-(4-amino-1,2,5-oxadiazol-3-yl)-1-ethyl-N-[2-(methylamino)ethyl]-1H-imidazo[4,5-c]pyridine-7-carboxamide::oxadiazole-containing compound, 2
SMILES: CCn1c(nc2cncc(C(=O)NCCNC)c12)-c1nonc1N
InChI Key: InChIKey=RIIYKHQJSKRYKG-UHFFFAOYSA-N
Data: 5 IC50
Activity Spreadsheet -- Enzyme Inhibition Constant Data from BindingDB
Found 5 hits for monomerid = 24990
Trg + Lig
Ki
nM
ΔG°
kcal/mole
IC50
nM
Kd
nM
EC50/IC50
nM
koff
s-1
kon
M-1s-1
pHTemp
°C
RAC-alpha serine/threonine-protein kinase
(Homo sapiens (Human))
BDBM24990
(2-(4-amino-1,2,5-oxadiazol-3-yl)-1-ethyl-N-[2-(met...)
Show SMILES CCn1c(nc2cncc(C(=O)NCCNC)c12)-c1nonc1N
Show InChI InChI=1S/C14H18N8O2/c1-3-22-11-8(14(23)18-5-4-16-2)6-17-7-9(11)19-13(22)10-12(15)21-24-20-10/h6-7,16H,3-5H2,1-2H3,(H2,15,21)(H,18,23)
n/an/a 126n/an/an/an/a7.522
GlaxoSmithKline
Assay Description
IC50 is the inhibitor concentration, which inhibits 50% of kinase activity that catalyzes the transfer of the terminal phosphate from radiolabeled AT...
J Med Chem 51: 5663-79 (2008)
Article DOI: 10.1021/jm8004527
BindingDB Entry DOI: 10.7270/Q29G5K3H
Serine/threonine-protein kinase AKT2
(Homo sapiens (Human))
BDBM24990
(2-(4-amino-1,2,5-oxadiazol-3-yl)-1-ethyl-N-[2-(met...)
Show SMILES CCn1c(nc2cncc(C(=O)NCCNC)c12)-c1nonc1N
Show InChI InChI=1S/C14H18N8O2/c1-3-22-11-8(14(23)18-5-4-16-2)6-17-7-9(11)19-13(22)10-12(15)21-24-20-10/h6-7,16H,3-5H2,1-2H3,(H2,15,21)(H,18,23)
n/an/a 3.98E+3n/an/an/an/an/an/a
GlaxoSmithKline
Assay Description
IC50 is the inhibitor concentration, which inhibits 50% of kinase activity that catalyzes the transfer of the terminal phosphate from radiolabeled AT...
J Med Chem 51: 5663-79 (2008)
Article DOI: 10.1021/jm8004527
BindingDB Entry DOI: 10.7270/Q29G5K3H
Rho-associated protein kinase 1
(Homo sapiens (Human))
BDBM24990
(2-(4-amino-1,2,5-oxadiazol-3-yl)-1-ethyl-N-[2-(met...)
Show SMILES CCn1c(nc2cncc(C(=O)NCCNC)c12)-c1nonc1N
Show InChI InChI=1S/C14H18N8O2/c1-3-22-11-8(14(23)18-5-4-16-2)6-17-7-9(11)19-13(22)10-12(15)21-24-20-10/h6-7,16H,3-5H2,1-2H3,(H2,15,21)(H,18,23)
NCI pathway
Reactome pathway
n/an/a 5n/an/an/an/an/an/a
GlaxoSmithKline
Assay Description
IC50 is the inhibitor concentration, which inhibits 50% of kinase activity that catalyzes the transfer of the terminal phosphate from radiolabeled AT...
J Med Chem 51: 5663-79 (2008)
Article DOI: 10.1021/jm8004527
BindingDB Entry DOI: 10.7270/Q29G5K3H
Ribosomal protein S6 kinase alpha 5
(Homo sapiens (Human))
BDBM24990
(2-(4-amino-1,2,5-oxadiazol-3-yl)-1-ethyl-N-[2-(met...)
Show SMILES CCn1c(nc2cncc(C(=O)NCCNC)c12)-c1nonc1N
Show InChI InChI=1S/C14H18N8O2/c1-3-22-11-8(14(23)18-5-4-16-2)6-17-7-9(11)19-13(22)10-12(15)21-24-20-10/h6-7,16H,3-5H2,1-2H3,(H2,15,21)(H,18,23)
NCI pathway
Reactome pathway
n/an/a 15n/an/an/an/an/an/a
GlaxoSmithKline
Assay Description
IC50 is the inhibitor concentration, which inhibits 50% of kinase activity that catalyzes the transfer of the terminal phosphate from radiolabeled AT...
J Med Chem 51: 5663-79 (2008)
Article DOI: 10.1021/jm8004527
BindingDB Entry DOI: 10.7270/Q29G5K3H
Serine/threonine-protein kinase AKT
(Homo sapiens (Human))
BDBM24990
(2-(4-amino-1,2,5-oxadiazol-3-yl)-1-ethyl-N-[2-(met...)
Show SMILES CCn1c(nc2cncc(C(=O)NCCNC)c12)-c1nonc1N
Show InChI InChI=1S/C14H18N8O2/c1-3-22-11-8(14(23)18-5-4-16-2)6-17-7-9(11)19-13(22)10-12(15)21-24-20-10/h6-7,16H,3-5H2,1-2H3,(H2,15,21)(H,18,23)
NCI pathway
Reactome pathway
n/an/a 1.41E+3n/an/an/an/an/an/a
GlaxoSmithKline
Assay Description
IC50 is the inhibitor concentration, which inhibits 50% of kinase activity that catalyzes the transfer of the terminal phosphate from radiolabeled AT...
J Med Chem 51: 5663-79 (2008)
Article DOI: 10.1021/jm8004527
BindingDB Entry DOI: 10.7270/Q29G5K3H