BDBM24999 4-[7-(3-aminopropoxy)-1-ethyl-4-(furan-3-yl)-1H-imidazo[4,5-c]pyridin-2-yl]-1,2,5-oxadiazol-3-amine::oxadiazole-containing compound, 11b
SMILES: CCn1c(nc2c(ncc(OCCCN)c12)-c1ccoc1)-c1nonc1N
InChI Key: InChIKey=SXRCGQAHDJRHJC-UHFFFAOYSA-N
Data: 4 IC50
Activity Spreadsheet -- Enzyme Inhibition Constant Data from BindingDB
Found 4 hits for monomerid = 24999
Trg + Lig
Ki
nM
ΔG°
kcal/mole
IC50
nM
Kd
nM
EC50/IC50
nM
koff
s-1
kon
M-1s-1
pHTemp
°C
RAC-alpha serine/threonine-protein kinase
(Homo sapiens (Human))
BDBM24999
(4-[7-(3-aminopropoxy)-1-ethyl-4-(furan-3-yl)-1H-im...)
Show SMILES CCn1c(nc2c(ncc(OCCCN)c12)-c1ccoc1)-c1nonc1N
Show InChI InChI=1S/C17H19N7O3/c1-2-24-15-11(26-6-3-5-18)8-20-12(10-4-7-25-9-10)13(15)21-17(24)14-16(19)23-27-22-14/h4,7-9H,2-3,5-6,18H2,1H3,(H2,19,23)
n/an/a 79n/an/an/an/a7.522
GlaxoSmithKline
Assay Description
IC50 is the inhibitor concentration, which inhibits 50% of kinase activity that catalyzes the transfer of the terminal phosphate from radiolabeled AT...
J Med Chem 51: 5663-79 (2008)
Article DOI: 10.1021/jm8004527
BindingDB Entry DOI: 10.7270/Q29G5K3H
Ribosomal protein S6 kinase alpha 1
(Homo sapiens (Human))
BDBM24999
(4-[7-(3-aminopropoxy)-1-ethyl-4-(furan-3-yl)-1H-im...)
Show SMILES CCn1c(nc2c(ncc(OCCCN)c12)-c1ccoc1)-c1nonc1N
Show InChI InChI=1S/C17H19N7O3/c1-2-24-15-11(26-6-3-5-18)8-20-12(10-4-7-25-9-10)13(15)21-17(24)14-16(19)23-27-22-14/h4,7-9H,2-3,5-6,18H2,1H3,(H2,19,23)
NCI pathway
Reactome pathway
n/an/a 71n/an/an/an/an/an/a
GlaxoSmithKline
Assay Description
IC50 is the inhibitor concentration, which inhibits 50% of kinase activity that catalyzes the transfer of the terminal phosphate from radiolabeled AT...
J Med Chem 51: 5663-79 (2008)
Article DOI: 10.1021/jm8004527
BindingDB Entry DOI: 10.7270/Q29G5K3H
Rho-associated protein kinase 1
(Homo sapiens (Human))
BDBM24999
(4-[7-(3-aminopropoxy)-1-ethyl-4-(furan-3-yl)-1H-im...)
Show SMILES CCn1c(nc2c(ncc(OCCCN)c12)-c1ccoc1)-c1nonc1N
Show InChI InChI=1S/C17H19N7O3/c1-2-24-15-11(26-6-3-5-18)8-20-12(10-4-7-25-9-10)13(15)21-17(24)14-16(19)23-27-22-14/h4,7-9H,2-3,5-6,18H2,1H3,(H2,19,23)
NCI pathway
Reactome pathway
n/an/a 562n/an/an/an/an/an/a
GlaxoSmithKline
Assay Description
IC50 is the inhibitor concentration, which inhibits 50% of kinase activity that catalyzes the transfer of the terminal phosphate from radiolabeled AT...
J Med Chem 51: 5663-79 (2008)
Article DOI: 10.1021/jm8004527
BindingDB Entry DOI: 10.7270/Q29G5K3H
Ribosomal protein S6 kinase alpha 5
(Homo sapiens (Human))
BDBM24999
(4-[7-(3-aminopropoxy)-1-ethyl-4-(furan-3-yl)-1H-im...)
Show SMILES CCn1c(nc2c(ncc(OCCCN)c12)-c1ccoc1)-c1nonc1N
Show InChI InChI=1S/C17H19N7O3/c1-2-24-15-11(26-6-3-5-18)8-20-12(10-4-7-25-9-10)13(15)21-17(24)14-16(19)23-27-22-14/h4,7-9H,2-3,5-6,18H2,1H3,(H2,19,23)
NCI pathway
Reactome pathway
n/an/a 162n/an/an/an/an/an/a
GlaxoSmithKline
Assay Description
IC50 is the inhibitor concentration, which inhibits 50% of kinase activity that catalyzes the transfer of the terminal phosphate from radiolabeled AT...
J Med Chem 51: 5663-79 (2008)
Article DOI: 10.1021/jm8004527
BindingDB Entry DOI: 10.7270/Q29G5K3H