BDBM250648 US9447148, 9.17
SMILES: CCCCCC(=O)N[C@H]1CCC(=O)NCC[C@H](NC(=O)[C@H](CCCNC(N)=N)NC(=O)[C@@H](Cc2ccccc2)NC(=O)[C@H](Cc2c[nH]cn2)NC1=O)C(=O)N[C@@H](Cc1c[nH]c2ccccc12)C(N)=O
InChI Key:
Data: 2 KI  1 EC50
Activity Spreadsheet -- Enzyme Inhibition Constant Data from BindingDB
Found 3 hits for monomerid = 250648
Trg + Lig
Ki
nM
ΔG°
kcal/mole
IC50
nM
Kd
nM
EC50/IC50
nM
koff
s-1
kon
M-1s-1
pHTemp
°C
Melanocyte-stimulating hormone receptor
(Homo sapiens (Human))
BDBM250648
(US9447148, 9.17)
Show SMILES CCCCCC(=O)N[C@H]1CCC(=O)NCC[C@H](NC(=O)[C@H](CCCNC(N)=N)NC(=O)[C@@H](Cc2ccccc2)NC(=O)[C@H](Cc2c[nH]cn2)NC1=O)C(=O)N[C@@H](Cc1c[nH]c2ccccc12)C(N)=O |r|
US Patent
0.0250 -15.0n/an/an/an/an/a7.537
Palatin Technologies, Inc.
US Patent
Assay Description
A competitive inhibition binding assay was performed using membrane homogenates prepared from HEK-293 cells that express recombinant hMCR-1a or hMCR-...
US Patent US9447148 (2016)
BindingDB Entry DOI: 10.7270/Q2RJ4HD2
Melanocortin receptor 4
(Homo sapiens (Human))
BDBM250648
(US9447148, 9.17)
Show SMILES CCCCCC(=O)N[C@H]1CCC(=O)NCC[C@H](NC(=O)[C@H](CCCNC(N)=N)NC(=O)[C@@H](Cc2ccccc2)NC(=O)[C@H](Cc2c[nH]cn2)NC1=O)C(=O)N[C@@H](Cc1c[nH]c2ccccc12)C(N)=O |r|
US Patent
110 -9.87n/an/an/an/an/a7.537
Palatin Technologies, Inc.
US Patent
Assay Description
A competitive inhibition binding assay was performed using membrane homogenates prepared from HEK-293 cells that express recombinant hMCR-1a or hMCR-...
US Patent US9447148 (2016)
BindingDB Entry DOI: 10.7270/Q2RJ4HD2
Melanocyte-stimulating hormone receptor
(Homo sapiens (Human))
BDBM250648
(US9447148, 9.17)
Show SMILES CCCCCC(=O)N[C@H]1CCC(=O)NCC[C@H](NC(=O)[C@H](CCCNC(N)=N)NC(=O)[C@@H](Cc2ccccc2)NC(=O)[C@H](Cc2c[nH]cn2)NC1=O)C(=O)N[C@@H](Cc1c[nH]c2ccccc12)C(N)=O |r|
US Patent
n/an/an/an/a 0.00400n/an/a7.537
Palatin Technologies, Inc.
US Patent
Assay Description
Accumulation of intracellular cAMP was examined as a measure of the ability of the peptides of the present invention to elicit a functional response ...
US Patent US9447148 (2016)
BindingDB Entry DOI: 10.7270/Q2RJ4HD2